{"text_format":"1","workbook":"xlsx","n_sheets":11,"sheets":["SSV_Organisation","SSV_Lizenz_Auswertung","Alterskategorie","LabelPrint","Konfiguration","Version","Anleitung","OVM","SVWS","Rangliste","DataSource"],"not_rendered":{"charts":0,"images":16,"macros":1,"external_links":0,"defined_names":15,"comments":2,"pivot_tables":0},"unopened":[],"bounds":{"document_bytes":16777216,"sheet_cells":100000,"rows_first":2000,"rows_last":500,"rows_between":2000,"halvings":0,"cell_chars":16384,"cell_head_chars":4096},"cells_cut":0,"cells_raw":0,"read":"whole","date_system":"1900"}

{"sheet":"SSV_Organisation","index":0,"n_rows":46,"n_cols":26,"rows_kept":46,"cut":false,"hidden":true,"merged":[]}
["Vereinsnummer","Vereinsname","Kreis","Distanz 10m","Distanz 50m","PLZ","Ort","Grp.Dpp.",null,null,null,null,null,null,null,null,null,null,null,null,null,null,null,null,null,"ZDesigner ZD420-203dpi ZPL"]
["1.44","Brother QL-800",null,null,null,9220,"",null,null,null,null,null,null,null,null,null,null,null,null,null,null,null,null,null,null,"Snagit 2020"]
["1.44.0.00.001","Altstätten Sportschützen",2,"10m","50m","9450","Altstätten",null,null,null,null,null,null,null,null,null,null,null,null,null,null,null,null,null,null,"SANEI BL112II"]
["1.44.0.00.002","Appenzell Luftgewehrsektion",2,"10m","-","9050","Appenzell",null,null,null,null,null,null,null,null,null,null,null,null,null,null,null,null,null,null,"OneNote (Desktop) - Protected"]
["1.20.0.01.014","Arbon-Roggwil, Tälischützen",6,"10m","50m",9320,"Arbon",null,null,null,null,null,null,null,null,null,null,null,null,null,null,null,null,null,null,"OneNote (Desktop)"]
["1.44.0.00.004","Bad Ragaz Kleinkaliberschützen",4,"-","50m","7310","Bad Ragaz",null,null,null,null,null,null,null,null,null,null,null,null,null,null,null,null,null,null,"Microsoft XPS Document Writer"]
["1.44.0.00.006","Bazenheid Sportschützen",7,"-","50m","9602","Bazenheid",null,null,null,null,null,null,null,null,null,null,null,null,null,null,null,null,null,null,"Microsoft Print to PDF"]
["1.44.0.00.007","Bischofszell Sportschützen",6,"10m","50m","9220","Bischofszell",null,null,null,null,null,null,null,null,null,null,null,null,null,null,null,null,null,null,"HP Color LaserJet Pro MFP M277 PCL 6"]
["1.44.0.00.008","Bottighofen Sportschützen",8,"-","50m","8598","Bottighofen",null,null,null,null,null,null,null,null,null,null,null,null,null,null,null,null,null,null,"Fax"]
["1.17.0.10.015","Brunnadern Sportschützen Neckertal",5,"10m","50m",9125,"Brunnadern",null,null,null,null,null,null,null,null,null,null,null,null,null,null,null,null,null,null,"Brother QL-800"]
{"$rows_left_out":37}
{"sheet":"SSV_Lizenz_Auswertung","index":1,"n_rows":610,"n_cols":23,"rows_kept":610,"cut":false,"hidden":true,"merged":[]}
["Vereinsnummer","Vereinsname","Personennummer","Lizenznummer","Vorname","Nachname","Strasse","PLZ","Ort","Land","Geschlecht","Geburtsdatum","Kategorie","Lizenzkategorie","Lizenztyp","P1","P2","P3","Stlg.","Kreis","Karte","Presi.","mail"]
["1.17.0.01.036","Goldach Schützengesellschaft","1857216","935793","Ronja","Blattner","Langmoosstrasse 20","9400","Rorschach","CH","Weiblich","2004-05-15","Aktiv-A G50m","A","LizenzG50m",null,null,null,null,1]
["1.17.0.01.036","Goldach Schützengesellschaft","1064908","116823","Roman","Bollhalder","Peter + Paulstr. 8","9010","St. Gallen","CH","Männlich","1978-02-25","Aktiv-A G50m","A","LizenzG50m",null,null,null,null,1]
["1.17.0.01.036","Goldach Schützengesellschaft","1076494","128410","Josef","Frei","Ilgenweg 3","9403","Goldach","CH","Männlich","1953-02-08","Aktiv-A G50m","A","LizenzG50m",null,null,null,null,1]
["1.17.0.01.036","Goldach Schützengesellschaft","1064919","116834","Josef","Hasler","Halten 5","9300","Wittenbach","CH","Männlich","1943-08-30","Aktiv-A G50m","A","LizenzG50m",null,null,null,null,1]
["1.17.0.01.036","Goldach Schützengesellschaft","1076500","128416","Bruno","Hauser","Sonnenweg 4","9403","Goldach","CH","Männlich","1949-09-10","Aktiv-A G50m","A","LizenzG50m",null,null,null,null,1]
["1.17.0.01.036","Goldach Schützengesellschaft","1064920","116835","Alfred","Hauser","Sturzbüchelstr. 4","9300","Wittenbach","CH","Männlich","1942-09-14","Aktiv-A G50m","A","LizenzG50m",null,null,null,null,1]
["1.17.0.01.036","Goldach Schützengesellschaft","1082817","134734","Horst","Keller","Schulhausstr. 3a","9422","Staad SG","CH","Männlich","1969-12-17","Aktiv-A G50m","A","LizenzG50m",null,null,null,null,1]
["1.17.0.01.036","Goldach Schützengesellschaft","1889905","970105","Andrzej","Knop","Steigstr. 3a","9422","Staad SG","CH","Männlich","1964-05-06","Aktiv-A G50m","A","LizenzG50m",null,null,null,null,1]
["1.17.0.01.036","Goldach Schützengesellschaft","1889906","970106","Justyna","Knop","Steigstr. 3a","9422","Staad SG","CH","Weiblich","1979-01-21","Aktiv-A G50m","A","LizenzG50m",null,null,null,null,1]
{"$rows_left_out":601}
{"sheet":"Alterskategorie","index":2,"n_rows":110,"n_cols":6,"rows_kept":110,"cut":false,"hidden":true,"merged":[[6,2,6,4],[11,2,11,4],[10,3,10,4],[8,3,8,4]]}
["Alter","Kategorie","Hatswil Sportschützen",null,null,"OVWS 2024"]
[1,"-","VLM 2026"]
[2,"-","Benz Rudolf",null,null,"Gouveia Lourenzo          2004"]
[3,"-","Stellg. aufgl."]
[4,"-","Anz. Probe: __",null,null,"Kreuzlingen         22.05.2024"]
[5,"-"]
[6,"-"]
[8,"U10"]
[9,"U10"]
[10,"U15"]
{"$rows_left_out":101}
{"sheet":"LabelPrint","index":3,"n_rows":5,"n_cols":2,"rows_kept":5,"cut":false,"hidden":true,"merged":[[0,0,0,1],[1,0,1,1],[4,0,4,1]]}
["SVWS 2026"]
["Dettighofen Sportschützen"]
["Schmied Roger",1978]
["113390","Stellg. frei"]
["2 x E10 Schuss A10"]

{"sheet":"Konfiguration","index":4,"n_rows":11,"n_cols":27,"rows_kept":11,"cut":false,"hidden":true,"merged":[]}
["Etiketten Druck","Nein",null,null,null,null,null,null,null,null,null,null,null,null,null,null,null,null,null,null,null,null,null,null,"HP Color LaserJet Pro MFP M277 PCL 6","HP Color LaserJet Pro MFP M277 PCL 6 auf Ne05:","Ja"]
["Drucker",null,null,null,null,null,null,null,null,null,null,null,null,null,null,null,null,null,null,null,null,null,null,null,"Snagit 2020","Snagit 2020 auf Ne01:","Nein"]
[null,null,null,null,null,null,null,null,null,null,null,null,null,null,null,null,null,null,null,null,null,null,null,null,"SANEI BL112II","SANEI BL112II auf Ne02:"]
[null,null,null,null,null,null,null,null,null,null,null,null,null,null,null,null,null,null,null,null,null,null,null,null,"ZDesigner ZD420-203dpi ZPL","ZDesigner ZD420-203dpi ZPL auf Ne00:"]
[null,null,null,null,null,null,null,null,null,null,null,null,null,null,null,null,null,null,null,null,null,null,null,null,"Microsoft XPS Document Writer","Microsoft XPS Document Writer auf Ne03:"]
[null,null,null,null,null,null,null,null,null,null,null,null,null,null,null,null,null,null,null,null,null,null,null,null,"Microsoft Print to PDF","Microsoft Print to PDF auf Ne04:"]
[null,null,null,null,null,null,null,null,null,null,null,null,null,null,null,null,null,null,null,null,null,null,null,null,"Fax","Fax auf Ne06:"]
[null,null,null,null,null,null,null,null,null,null,null,null,null,null,null,null,null,null,null,null,null,null,null,null,"Brother HL-L2370DN series Printer","Brother HL-L2370DN series Printer auf Ne08:"]
[null,null,null,null,null,null,null,null,null,null,null,null,null,null,null,null,null,null,null,null,null,null,null,null,"OneNote (Desktop) - Protected","OneNote (Desktop) - Protected auf Ne03:"]
[null,null,null,null,null,null,null,null,null,null,null,null,null,null,null,null,null,null,null,null,null,null,null,null,"Brother QL-800","Brother QL-800 auf Ne07:"]
{"$rows_left_out":2}
{"sheet":"Version","index":5,"n_rows":2,"n_cols":2,"rows_kept":2,"cut":false,"hidden":false,"merged":[]}
["Stand:","2026-07-26"]
["Freigabe für:","SVWS 2026"]

{"sheet":"Anleitung","index":6,"n_rows":40,"n_cols":2,"rows_kept":40,"cut":false,"hidden":false,"merged":[]}
["Kurzanleitung:"]
[]
["-Ordner OVM auf Desktop oder in einen Ordner legen. Excel Datei OVM_.xlsm öffnen."]
["-Makros aktivieren."]
["Foto 1",{"$error":"#VALUE!"}]
["-Feld neben Kreis anklicken und Kreis aus Liste wählen. Foto 2"]
["Foto 2",{"$error":"#VALUE!"}]
["-Feld unter OVM Anlass anklicken und Anlass auswählen."]
["  Wenn SVWS angewählt wird blendet sich die SVWS Tabelle automatisch ein."]
["  Wenn VLM angewählt wird blendet sich automatisch eine 3. Passe ein."]
{"$rows_left_out":31}
{"sheet":"OVM","index":7,"n_rows":115,"n_cols":32,"rows_kept":115,"cut":false,"hidden":false,"merged":[[35,24,35,26],[48,24,48,26],[1,10,3,11],[13,2,13,4],[13,9,13,13],[20,12,20,13],[16,12,16,13],[18,12,18,13],[19,12,19,13],[22,24,22,26],[17,12,17,13],[7,9,7,13],[9,0,9,1],[9,2,9,4],[9,9,9,13],[7,0,7,1],[15,0,15,1],[15,12,15,13],[10,0,10,1],[10,2,10,4],[10,9,10,13],[11,2,11,4],[11,9,11,13],[12,2,12,4],[12,9,12,13]]}
[]
[null,null,null,null,null,null,null,null,null,null,2026]
[]
[]
[]
[null,null,null,null,null,null,null,null,null,"Kreis:",7,null,"50m"]
["OVM Anlass"]
["SVWS",null,{"$f":"IF(A8=\"VLM\",3,IF(A8<>\"VLM\",2,2))","v":2},null,null,null,"Vereinsname:",null,null,"Dettighofen Sportschützen",null,null,null,null,null,{"$f":"IFERROR(LOOKUP($J$8,OVM!AF24:AF48,OVM!AD24:AD48),0)","v":13},44,null,"männlich"]
[null,null,null,null,null,null,null,null,null,{"$f":"IF(J8=\"\",\"\",INDEX(SSV_Organisation!$A$3:$A$46,MATCH($J$8&$M$6&$K$6,SSV_Organisation!$B$3:$B$46&SSV_Organisation!$E$3:$E$46&SSV_Organisation!$C$3:$C$46,0)))","v":"1.44.0.00.010"},null,null,null,null,null,null,null,null,"weiblich"]
["Korrespondenz Adresse:",null,"Name, Vorname:",null,null,null,null,null,null,"Mäder Thomas"]
{"$rows_left_out":106}
{"sheet":"SVWS","index":8,"n_rows":67,"n_cols":29,"rows_kept":67,"cut":false,"hidden":false,"merged":[[8,2,8,4],[8,9,8,13],[5,0,5,13],[6,3,6,4],[6,9,6,13],[7,2,7,4],[7,9,7,13],[9,0,9,1],[9,2,9,4],[9,9,9,13],[10,0,10,1],[10,2,10,4],[10,9,10,13],[17,9,17,11],[17,12,17,13],[11,2,11,4],[11,9,11,13],[12,2,12,4],[12,9,12,13],[13,2,13,4],[13,9,13,13],[15,0,15,1],[15,9,15,11],[15,12,15,13],[16,9,16,11],[16,12,16,13],[22,23,22,26],[65,4,65,9],[66,4,66,9],[18,9,18,11],[18,12,18,13],[19,9,19,11],[19,12,19,13],[20,9,20,11],[20,12,20,13]]}
[null,null,"SCHWEIZER SCHIESSSPORTVERBAND",null,null,null,null,null,null,null,"Rolf Binz"]
[null,null,"FÉDÉRATION SPORTIVE SUISSE DE TIR",null,null,null,null,null,null,null,"Huntelweg 8"]
[null,null,"FEDERAZIONE SPORTIVA SVIZZERA DI TIRO",null,null,null,null,null,null,null,"4586 Buchegg"]
[null,null,null,null,null,null,null,null,null,null,"032 661 17 09"]
[null,null,"V2023_11",null,null,null,null,null,null,null,"binz-wirth@gawnet.ch"]
["__________________________________________________________________________________________________"]
["Vereinswettschiessen",null,null,{"$f":"OVM!$K$2","v":2026},null,null,null,null,null,"Gewehr 50 Meter"]
["Verein:",null,"Vereinsname:",null,null,null,null,null,null,{"$f":"OVM!J8","v":"Dettighofen Sportschützen"}]
[null,null,"Vereinsnummer:",null,null,null,null,null,null,{"$f":"OVM!J9","v":"1.44.0.00.010"}]
["Korrespondenz Adresse:",null,"Name, Vorname:",null,null,null,null,null,null,"?"]
{"$rows_left_out":58}
{"sheet":"Rangliste","index":9,"n_rows":134,"n_cols":21,"rows_kept":134,"cut":false,"hidden":false,"merged":[[2,3,2,8]]}
[null,null,null,null,null,null,null,null,null,""]
[]
[null,null,null,{"$f":"_xlfn.CONCAT(\"Rangliste \",OVM!$A$8,\" \",OVM!$K$2)","v":"Rangliste SVWS 2026"}]
[null,null,null,null,null,null,null,"E / S",{"$f":"COUNTIF($F$9:$F$108,\"E\")+COUNTIF($F$9:$F$108,\"S\")","v":0},{"$f":"IF(OVM!A8=\"VLM\",1800,1200)","v":1200}]
[null,{"$f":"_xlfn.CONCAT(\"Kreis \",OVM!$K$6)","v":"Kreis 7"},null,"Einzelrangliste",null,null,null,"U10-U21",{"$f":"COUNTIF($F$9:$F$108,\"U10\")+COUNTIF($F$9:$F$108,\"U15\")+COUNTIF($F$9:$F$108,\"U17\")+COUNTIF($F$9:$F$108,\"U19\")+COUNTIF($F$9:$F$108,\"U21\")","v":0},{"$f":"COUNTIF($F$9:$F$108,\"U10\")+COUNTIF($F$9:$F$108,\"U15\")+COUNTIF($F$9:$F$108,\"U17\")+COUNTIF($F$9:$F$108,\"U19\")+COUNTIF($F$9:$F$108,\"U21\")","v":0},null,null,null,"1905-07-16"]
[null,null,null,null,"KKarten:",{"$f":"SUM(L9:L108)","v":0},null,"V / SV",{"$f":"COUNTIF($F$9:$F$108,\"V\")+COUNTIF($F$9:$F$108,\"SV\")","v":0},{"$f":"COUNTIF($F$9:$F$108,\"V\")+COUNTIF($F$9:$F$108,\"SV\")","v":0}]
[null,null,null,null,null,null,null,null,1]
[null,"Name","Vorname","Verein","Jg","Kat.","Punkte","Kreis","Gruppe",null,null,"Karten","Mann.","Gruppe","Zeile SSV","Grp. Sort.","Verein",null,"Grp.","Alter","Kat."]
[1,null,null,null,null,{"$f":"IF(B9<>\"\",(LOOKUP(T9,Alterskategorie!$A$2:$A$110,Alterskategorie!$B$2:$B$110)),\"\")","v":""},null,null,null,{"$f":"IF(IF(P9=1,K9,IF(AND(K9<>0,D9=D8),J8+K9,0))>J$4,K9,IF(P9=1,K9,IF(AND(K9<>0,D9=D8),J8+K9,0)))","v":0},{"$f":"IF($P9<=M9*6,$G9,0)","v":0},null,{"$f":"IFERROR(LOOKUP($D9,SSV_Organisation[Vereinsname],SSV_Organisation[Grp.Dpp.]),0)","v":0},{"$f":"IF(AND(P9<7,M9>0),1,IF(AND(P9<13,M9>1),2,IF(AND(P9<19,M9>2),3,IF(AND(P9<25,M9>3),4,IF(AND(P9<31,M9>4),5,IF(AND(P9<37,M9>5),6,0))))))","v":0},497,1,{"$f":"IF(AND($M9>0,$D9<>$D10),D9,IF(OR($P9=6,$P9=12,$P9=18,$P9=24,$P9=30,$P9=36,$P9=42,$P9=48,$P9=54,$P9=60,$P9=66,$P9=72,$P9=78,$P9=84,$P9=90,$P9=96),$D9,\"\"))","v":""},{"$f":"IF(AND($M9>0,$D9<>$D10),$D9,\"\")","v":""},{"$f":"IF(Q9<>\"\",SUM(J9),\"\")","v":""},{"$f":"IF(ISBLANK(E9),\"\",$N$5-E9)","v":""},{"$f":"IF(T9<>\"\",(LOOKUP(T9,Alterskategorie!$A$2:$A$110,Alterskategorie!$B$2:$B$110)),\"\")","v":""}]
[{"$f":"IF(B10>\"\",A9+1,\"\")","v":""},null,null,null,null,{"$f":"IF(B10<>\"\",(LOOKUP(T10,Alterskategorie!$A$2:$A$110,Alterskategorie!$B$2:$B$110)),\"\")","v":""},null,null,null,{"$f":"IF(IF(P10=1,K10,IF(AND(K10<>0,D10=D9),J9+K10,0))>J$4,K10,IF(P10=1,K10,IF(AND(K10<>0,D10=D9),J9+K10,0)))","v":0},{"$f":"IF($P10<=M10*6,$G10,0)","v":0},null,{"$f":"IFERROR(LOOKUP($D10,SSV_Organisation[Vereinsname],SSV_Organisation[Grp.Dpp.]),0)","v":0},{"$f":"IF(AND(P10<7,M10>0),1,IF(AND(P10<13,M10>1),2,IF(AND(P10<19,M10>2),3,IF(AND(P10<25,M10>3),4,IF(AND(P10<31,M10>4),5,IF(AND(P10<37,M10>5),6,0))))))","v":0},500,{"$f":"IF(ISBLANK($D10),\"\",IF($D10=$D9,$P9+1,1))","v":""},{"$f":"IF(AND($M10>0,$D10<>$D11),D10,IF(OR($P10=6,$P10=12,$P10=18,$P10=24,$P10=30,$P10=36,$P10=42,$P10=48,$P10=54,$P10=60,$P10=66,$P10=72,$P10=78,$P10=84,$P10=90,$P10=96),$D10,\"\"))","v":""},{"$f":"IF(AND($M10>0,$D10<>$D11),$D10,\"\")","v":""},{"$f":"IF(Q10<>\"\",SUM(J10),\"\")","v":""},"",{"$f":"IF(T10<>\"\",(LOOKUP(T10,Alterskategorie!$A$2:$A$110,Alterskategorie!$B$2:$B$110)),\"\")","v":""}]
{"$rows_left_out":125}
{"sheet":"DataSource","index":10,"n_rows":629,"n_cols":59,"rows_kept":629,"cut":false,"hidden":true,"merged":[]}
["PersonNumber","AddressNumber","FirstName","LastName","Company","Addition","Street","PostCode","City","Country","BusinessLandlinePhone","BusinessMobilePhone","PrivateLandlinePhone","PrivateMobilePhone","PrimaryEmail","Webpage","Gender","BirthDate","InsuranceNumber","Language","Nationality","OrganizationNumber","OrganizationName","IsActive","IsPassive","IsOtherAddressee","IsInsured","MembershipCategory","Remark","LicenseCategory","LicenseType","Salutation","AdditionalEmail","Deceased","OptedInForAdvertising","EntryDate","OfficialFunctionCategory","OfficialFunctionEntryDate","OfficialFunctionRemark","UseOnBoardAndFunctionaryReport","LicenseInvoicingClubNumber","LicenseInvoicingClubName","CourseCategory","Module","CompletedTrainingDate","TrainingStatus","NewsletterSSVType","SwissShootingSubscriptionType","SwissShootingSubscriptionStart","SwissShootingSubscriptionEnd","IsSingleSwissShootingSubscription","IsNewsletterMailDelivery","MuseumDataSalutation","MuseumDataCategory","ExitDate","OfficialFunctionExitDate","CompletedTrainingExpirationDate","SwissShootingSubscriptionAmount","Exported On"]
["1060763","112678","Werner","Hänggi","","Postfach 205","Städelistr. 7","9220","Bischofszell","CH","","","","","","","Männlich","10.08.1947","","Deutsch","CH","1.44.0.00.007","Bischofszell Sportschützen",1,0,0,1,"Aktiv-A G50m","","A","LizenzG50m","Herr","",0,1,"01.01.2023","","","",0,"1.20.0.01.026","Bischofszell Stadtschützen","","","","Aktiv","Newsletter Email","Abonnement","27.07.2023","","Nein","Nein","","","","","",1,"01.12.2023 14:27"]
["1060753","112668","Bernhard","Bischof","","","Bruggmühle 11","9220","Bischofszell","CH","071 424 26 56","","071 422 35 22","","bischof.beni@bluewin.ch","","Männlich","19.04.1949","","Deutsch","CH","1.44.0.00.007","Bischofszell Sportschützen",1,0,0,1,"Aktiv-A G50m","","A","LizenzG50m","Herr","",0,1,"01.01.2023","","","",0,"1.44.0.00.007","Bischofszell Sportschützen","","","","Aktiv","Newsletter Email","Abonnement","27.07.2023","","Nein","Nein","","","","","",1,"01.12.2023 14:27"]
["1060780","112695","Urs","Zihlmann","","","Rümlangerstr. 14","8105","Watt","CH","","","044 840 09 62","079 771 08 45","urzi@hispeed.ch","","Männlich","17.01.1955","","Deutsch","CH","1.44.0.00.007","Bischofszell Sportschützen",1,0,0,1,"Aktiv-B G50m","","B","LizenzG50m","Herr","",0,1,"01.01.2013","","","",0,"1.20.0.01.040","Hefenhofen-Dozwil Schützengesellschaft","","","","Aktiv","Newsletter Email","Abonnement","27.07.2023","","Nein","Nein","","","","","",1,"01.12.2023 14:27"]
["1060753","112668","Bernhard","Bischof","","","Bruggmühle 11","9220","Bischofszell","CH","071 424 26 56","","071 422 35 22","","bischof.beni@bluewin.ch","","Männlich","19.04.1949","","Deutsch","CH","1.44.0.00.007","Bischofszell Sportschützen",1,0,0,1,"Aktiv-A G10m Auflage","","A","LizenzG10m","Herr","",0,1,"01.10.2018","","","",0,"1.44.0.00.007","Bischofszell Sportschützen","","","","Aktiv","Newsletter Email","Abonnement","27.07.2023","","Nein","Nein","","","","","",1,"01.12.2023 14:27"]
["1060868","112783","Marlen","Schilliger","","","Städeliweg 5","9220","Bischofszell","CH","","","071 422 43 13","071 993 29 07","mschilliger@bluewin.ch","","Weiblich","02.10.1983","","Deutsch","CH","1.44.0.00.007","Bischofszell Sportschützen",1,0,0,1,"Aktiv-B G50m","","B","LizenzG50m","Frau","",0,0,"01.01.2023","","","",0,"1.44.0.00.055","Dicken Ebnat-Kappel Sportschützen","","","","Aktiv","Newsletter Email","Abonnement","27.07.2023","","Nein","Nein","","","","","",1,"01.12.2023 14:27"]
["1262339","314267","Thomas","Mäder","","","Ifangweg 4","8508","Homburg","CH","052 269 18 20","","052 765 27 75","079 326 34 75","thomas_maeder@bluewin.ch","","Männlich","22.04.1975","","Deutsch","CH","1.44.0.00.007","Bischofszell Sportschützen",1,0,0,1,"Aktiv-A G10m Auflage","","A","LizenzG10m","Herr","finanzen@ospsv.ch",0,1,"01.10.2021","","","",0,"1.44.0.00.010","Dettighofen Sportschützen","","","","Aktiv","Newsletter Email","Abonnement","27.07.2023","","Nein","Nein","","","","","",1,"01.12.2023 14:27"]
["1032180","008863","Rita","Burch","","","Obere Rebrainstr. 19","9213","Hauptwil","CH","","","071 422 40 67","079 698 09 31","rita.burch@resta.ch","","Weiblich","02.03.1952","","Deutsch","CH","1.44.0.00.007","Bischofszell Sportschützen",1,0,0,1,"Aktiv-A G50m","","A","LizenzG50m","Frau","",0,1,"22.02.2022","","","",0,"1.44.0.00.007","Bischofszell Sportschützen","","","","Aktiv","","","","","","","","","","","","","01.12.2023 14:27"]
["1056243","108158","Roman","Frei","","","Romanshornerstr. 28","8592","Uttwil","CH","","","0714636287","0795066168","freiroman@bluewin.ch","","Männlich","28.09.1961","756.6932.3539.64","Deutsch","CH","1.44.0.00.007","Bischofszell Sportschützen",1,0,0,1,"Aktiv-A G10m","","A","LizenzG10m","Herr","",0,1,"01.01.2023","","","",0,"1.44.0.00.007","Bischofszell Sportschützen","","","","Aktiv","Newsletter Email","Abonnement","27.07.2023","","Nein","Nein","","","","","",1,"01.12.2023 14:27"]
["1056243","108158","Roman","Frei","","","Romanshornerstr. 28","8592","Uttwil","CH","","","0714636287","0795066168","freiroman@bluewin.ch","","Männlich","28.09.1961","756.6932.3539.64","Deutsch","CH","1.44.0.00.007","Bischofszell Sportschützen",1,0,0,1,"Aktiv-B G50m","","B","LizenzG50m","Herr","",0,1,"01.01.2015","","","",0,"1.44.0.00.007","Bischofszell Sportschützen","","","","Aktiv","Newsletter Email","Abonnement","27.07.2023","","Nein","Nein","","","","","",1,"01.12.2023 14:27"]
{"$rows_left_out":619}