{"text_format":"1","workbook":"xlsx","n_sheets":11,"sheets":["SSV_Organisation","SSV_Lizenz_Auswertung","Alterskategorie","LabelPrint","Konfiguration","Version","Anleitung","OVM","SVWS","Rangliste","DataSource"],"not_rendered":{"charts":0,"images":16,"macros":1,"external_links":0,"defined_names":15,"comments":2,"pivot_tables":0},"unopened":[],"bounds":{"document_bytes":16777216,"sheet_cells":100000,"rows_first":2000,"rows_last":500,"rows_between":2000,"halvings":0,"cell_chars":16384,"cell_head_chars":4096},"cells_cut":0,"cells_raw":0,"read":"whole","date_system":"1900"}

{"sheet":"SSV_Organisation","index":0,"n_rows":46,"n_cols":26,"rows_kept":46,"cut":false,"hidden":true,"merged":[]}
["Vereinsnummer","Vereinsname","Kreis","Distanz 10m","Distanz 50m","PLZ","Ort","Grp.Dpp.",null,null,null,null,null,null,null,null,null,null,null,null,null,null,null,null,null,"ZDesigner ZD420-203dpi ZPL"]
["1.44","Brother QL-800",null,null,null,9220,"",null,null,null,null,null,null,null,null,null,null,null,null,null,null,null,null,null,null,"Snagit 2020"]
["1.44.0.00.001","Altstätten Sportschützen",2,"10m","50m","9450","Altstätten",null,null,null,null,null,null,null,null,null,null,null,null,null,null,null,null,null,null,"SANEI BL112II"]
["1.44.0.00.002","Appenzell Luftgewehrsektion",2,"10m","-","9050","Appenzell",null,null,null,null,null,null,null,null,null,null,null,null,null,null,null,null,null,null,"OneNote (Desktop) - Protected"]
["1.20.0.01.014","Arbon-Roggwil, Tälischützen",6,"10m","50m",9320,"Arbon",null,null,null,null,null,null,null,null,null,null,null,null,null,null,null,null,null,null,"OneNote (Desktop)"]
["1.44.0.00.004","Bad Ragaz Kleinkaliberschützen",4,"-","50m","7310","Bad Ragaz",null,null,null,null,null,null,null,null,null,null,null,null,null,null,null,null,null,null,"Microsoft XPS Document Writer"]
["1.44.0.00.006","Bazenheid Sportschützen",7,"-","50m","9602","Bazenheid",null,null,null,null,null,null,null,null,null,null,null,null,null,null,null,null,null,null,"Microsoft Print to PDF"]
["1.44.0.00.007","Bischofszell Sportschützen",6,"10m","50m","9220","Bischofszell",null,null,null,null,null,null,null,null,null,null,null,null,null,null,null,null,null,null,"HP Color LaserJet Pro MFP M277 PCL 6"]
["1.44.0.00.008","Bottighofen Sportschützen",8,"-","50m","8598","Bottighofen",null,null,null,null,null,null,null,null,null,null,null,null,null,null,null,null,null,null,"Fax"]
["1.17.0.10.015","Brunnadern Sportschützen Neckertal",5,"10m","50m",9125,"Brunnadern",null,null,null,null,null,null,null,null,null,null,null,null,null,null,null,null,null,null,"Brother QL-800"]
["1.17.0.05.016","Buchs-Räfis Schützengesellschaft",3,"10m","50m",9470,"Buchs",null,null,null,null,null,null,null,null,null,null,null,null,null,null,null,null,null,null,"Brother HL-L2370DN series Printer"]
["1.44.0.00.009","Degersheim Sportschützen",5,"-","50m","9113","Degersheim"]
["1.44.0.00.010","Dettighofen Sportschützen",7,"-","50m","8505","Dettighofen",0]
["1.44.0.00.055","Dicken Ebnat-Kappel Sportschützen",5,"-","50m","9115","Dicken Ebnat-Kappel"]
["1.44.0.00.011","Ebnat-Kappel & Umgebung Luftgewehrsektion",5,"10m","-","9642","Ebnat-Kappel & Umgebung"]
["1.44.0.00.012","Egnach Sportschützen",6,"-","50m","9322","Egnach"]
["1.44.0.00.058","Eschen Sportschützen",3,"10m","-","9492","Eschen"]
["1.20.0.04.062","Frauenfeld Stadtschützen Gesellschaft",7,"10m","50m",8500,"Frauenfeld"]
["1.15.0.00.002","Gais Sportschützen",2,"10m","-",9056,"Gais"]
["1.17.0.01.036","Goldach Schützengesellschaft",1,"10m","50m",9403,"Goldach"]
["1.17.0.01.170","Gossau SG Sportschützen",6,"10m","50m",9200,"Gossau"]
["1.44.0.00.017","Grabs Sportschützen",3,"10m","50m","9472","Grabs"]
["1.44.0.00.019","Hatswil Sportschützen",6,"-","50m","9999","Hatswil"]
["1.44.0.00.022","Kirchberg Sportschützen",5,"-","50m","9533","Kirchberg"]
["1.20.0.05.096","Kreuzlingen Schützenverein",8,"10m","50m",8280,"Kreuzlingen"]
["1.44.0.00.025","Lengwil Sportschützen",8,"-","50m","8574","Lengwil"]
["1.20.0.06.107","Märwil Schützenverein",7,"-","50m",9562,"Märwil"]
["1.44.0.00.027","Mels Kleinkaliberschützen",4,"-","50m","8887","Mels"]
["1.44.0.00.028","Mosnang Sportschützen",5,"-","50m","9607","Mosnang"]
["1.44.0.00.014","Neunforn Sportschützen",8,"-","50m","8525","Neunforn"]
["1.17.0.12.064","Niederbüren Schützenverein",7,"10m","-",9246,"Niederbüren"]
["1.44.0.00.031","Oberegg Luftgewehrsektion",2,"10m","-","9413","Oberegg"]
["1.17.0.06.080","Sargans Schützenverein",4,"10m","50m","7320","Sargans"]
["1.44.0.00.013","Schaffhausen Sportschützen Munot",8,"-","50m","8200","Schaffhausen"]
["1.44.0.00.034","Schönenbaumgarten Sportschützen",8,"-","50m","8585","Schönenbaumgarten"]
["1.20.0.08.149","Schönholzerswilen Schützen",7,"10m","-",8577,"Schönholzerswilen"]
["1.44.0.00.037","Sitterdorf Sportschützen",6,"10m","50m","8589","Sitterdorf"]
["1.17.0.01.091","St. Gallen Feldschützengesellschaft der Stadt",1,"10m","50m",9012,"St. Gallen"]
["1.44.0.00.059","Vaduz Sportschützen",3,"-","50m","9490","Vaduz"]
["1.44.0.00.045","Vaduz Zimmerschützen",3,"10m","-","9490","Vaduz"]
["1.44.0.00.046","Wängi Sportschützen",7,"-","50m","9545","Wängi"]
["1.20.0.08.179","Weinfelden Schützengesellschaft",7,"10m","50m",8570,"Weinfelden"]
["1.44.0.00.050","Weissbad Sportschützen",2,"-","50m","9057","Weissbad"]
["1.17.0.12.127","Wil SG Stadtschützen",7,"10m","50m",9500,"Wil SG"]
["1.44.0.00.052","Wildhaus Sportschützen",3,"10m","50m","9658","Wildhaus"]
["1.44.0.00.053","Wolfhalden Sportschützen",1,"-","50m","9427","Wolfhalden"]

{"sheet":"SSV_Lizenz_Auswertung","index":1,"n_rows":610,"n_cols":23,"rows_kept":610,"cut":false,"hidden":true,"merged":[]}
["Vereinsnummer","Vereinsname","Personennummer","Lizenznummer","Vorname","Nachname","Strasse","PLZ","Ort","Land","Geschlecht","Geburtsdatum","Kategorie","Lizenzkategorie","Lizenztyp","P1","P2","P3","Stlg.","Kreis","Karte","Presi.","mail"]
["1.17.0.01.036","Goldach Schützengesellschaft","1857216","935793","Ronja","Blattner","Langmoosstrasse 20","9400","Rorschach","CH","Weiblich","2004-05-15","Aktiv-A G50m","A","LizenzG50m",null,null,null,null,1]
["1.17.0.01.036","Goldach Schützengesellschaft","1064908","116823","Roman","Bollhalder","Peter + Paulstr. 8","9010","St. Gallen","CH","Männlich","1978-02-25","Aktiv-A G50m","A","LizenzG50m",null,null,null,null,1]
["1.17.0.01.036","Goldach Schützengesellschaft","1076494","128410","Josef","Frei","Ilgenweg 3","9403","Goldach","CH","Männlich","1953-02-08","Aktiv-A G50m","A","LizenzG50m",null,null,null,null,1]
["1.17.0.01.036","Goldach Schützengesellschaft","1064919","116834","Josef","Hasler","Halten 5","9300","Wittenbach","CH","Männlich","1943-08-30","Aktiv-A G50m","A","LizenzG50m",null,null,null,null,1]
["1.17.0.01.036","Goldach Schützengesellschaft","1076500","128416","Bruno","Hauser","Sonnenweg 4","9403","Goldach","CH","Männlich","1949-09-10","Aktiv-A G50m","A","LizenzG50m",null,null,null,null,1]
["1.17.0.01.036","Goldach Schützengesellschaft","1064920","116835","Alfred","Hauser","Sturzbüchelstr. 4","9300","Wittenbach","CH","Männlich","1942-09-14","Aktiv-A G50m","A","LizenzG50m",null,null,null,null,1]
["1.17.0.01.036","Goldach Schützengesellschaft","1082817","134734","Horst","Keller","Schulhausstr. 3a","9422","Staad SG","CH","Männlich","1969-12-17","Aktiv-A G50m","A","LizenzG50m",null,null,null,null,1]
["1.17.0.01.036","Goldach Schützengesellschaft","1889905","970105","Andrzej","Knop","Steigstr. 3a","9422","Staad SG","CH","Männlich","1964-05-06","Aktiv-A G50m","A","LizenzG50m",null,null,null,null,1]
["1.17.0.01.036","Goldach Schützengesellschaft","1889906","970106","Justyna","Knop","Steigstr. 3a","9422","Staad SG","CH","Weiblich","1979-01-21","Aktiv-A G50m","A","LizenzG50m",null,null,null,null,1]
["1.17.0.01.036","Goldach Schützengesellschaft","1030895","5545","Noah","Meier","Eschlenstr. 1","9404","Rorschacherberg","CH","Männlich","2010-11-16","Aktiv-A G50m","A","LizenzG50m",null,null,null,null,1]
["1.17.0.01.036","Goldach Schützengesellschaft","1026579","3189","Dennis","Schittenhelm","Hof 657","9426","Lutzenberg","CH","Männlich","2003-04-09","Aktiv-A G50m","A","LizenzG50m",null,null,null,null,1]
["1.17.0.01.036","Goldach Schützengesellschaft","1061405","113320","Thomas","Schlierenzauer","Grüeblistr. 2","9422","Staad SG","CH","Männlich","1955-06-09","Aktiv-A G50m","A","LizenzG50m",null,null,null,null,1]
["1.17.0.01.036","Goldach Schützengesellschaft","1060983","112898","Hanspeter","Steiner","Schöntalstr. 13","9032","Engelburg","CH","Männlich","1948-10-17","Aktiv-A G50m","A","LizenzG50m",null,null,null,null,1]
["1.17.0.01.036","Goldach Schützengesellschaft","1082358","134275","Peter","Thür","Wilenstr. 20","9422","Staad SG","CH","Männlich","1954-03-07","Aktiv-A G50m","A","LizenzG50m",null,null,null,null,1]
["1.17.0.01.036","Goldach Schützengesellschaft","1031023","5501","Alexander","Wenk","Föhrenstr. 14","9403","Goldach","CH","Männlich","2011-11-27","Aktiv-A G50m","A","LizenzG50m",null,null,null,null,1]
["1.17.0.01.036","Goldach Schützengesellschaft","1028714","5358","Sina","Ziltener","Haldenmühleweg 21","9403","Goldach","CH","Weiblich","2007-03-14","Aktiv-A G50m","A","LizenzG50m",null,null,null,null,1]
["1.17.0.01.036","Goldach Schützengesellschaft","1026577","3187","Samantha","Ziltener","Haldenmühleweg 21","9403","Goldach","CH","Weiblich","1985-10-24","Aktiv-A G50m","A","LizenzG50m",null,null,null,null,1]
["1.17.0.01.091","St. Gallen Feldschützengesellschaft der Stadt","1064198","116113","Martin","Alpiger","Langweid 12","9050","Appenzell","CH","Männlich","1959-09-03","Aktiv-A G50m","A","LizenzG50m",null,null,null,null,1]
["1.17.0.01.091","St. Gallen Feldschützengesellschaft der Stadt","2362003","45001","Nico","Baumann","Wenigerstrasse 24","9011","St. Gallen","CH","Männlich","2009-08-26","Aktiv-A G50m","A","LizenzG50m",null,null,null,null,1]
["1.17.0.01.091","St. Gallen Feldschützengesellschaft der Stadt","1061351","113266","Leonz","Boog","Poststr. 18","9410","Heiden","CH","Männlich","1941-04-17","Aktiv-A G50m","A","LizenzG50m",null,null,null,null,1]
["1.17.0.01.091","St. Gallen Feldschützengesellschaft der Stadt","1053401","105315","Peter","Brugger","Moosstr. 51","9014","St. Gallen","CH","Männlich","1943-09-08","Aktiv-A G50m","A","LizenzG50m",null,null,null,null,1]
["1.17.0.01.091","St. Gallen Feldschützengesellschaft der Stadt","1060755","112670","Blasius","Burch","Ob. Rebrainstr. 19","9213","Hauptwil","CH","Männlich","1948-01-19","Aktiv-B G50m","B","LizenzG50m",null,null,null,null,1]
["1.17.0.01.091","St. Gallen Feldschützengesellschaft der Stadt","1868794","948057","Joana","Bösch","Landhus 197","9103","Schwellbrunn","CH","Weiblich","2006-04-21","Aktiv-A G50m","A","LizenzG50m",null,null,null,null,1]
["1.17.0.01.091","St. Gallen Feldschützengesellschaft der Stadt","1066903","118818","Edi","Enggist","Kräzernstr. 43","9015","St. Gallen","CH","Männlich","1961-02-07","Aktiv-A G50m","A","LizenzG50m",null,null,null,null,1]
["1.17.0.01.091","St. Gallen Feldschützengesellschaft der Stadt","1061355","113270","Claudio","Fontanive","Demutstrasse 116","9012","St. Gallen","CH","Männlich","1947-05-21","Aktiv-A G50m","A","LizenzG50m",null,null,null,null,1]
["1.17.0.01.091","St. Gallen Feldschützengesellschaft der Stadt","1203770","255696","Tino","Good","Dialogplatz 10","8400","Winterthur","CH","Männlich","1987-12-23","Aktiv-A G50m","A","LizenzG50m",null,null,null,null,1]
["1.17.0.01.091","St. Gallen Feldschützengesellschaft der Stadt","1573232","634899","Sarina","Hitz","Prestenbergstr. 7","8576","Mauren","CH","Weiblich","2000-09-05","Aktiv-B G50m","B","LizenzG50m",null,null,null,null,1]
["1.17.0.01.091","St. Gallen Feldschützengesellschaft der Stadt","1060942","112857","Werner","Höhener","Buchen 6A","9056","Gais","CH","Männlich","1956-10-21","Aktiv-A G50m","A","LizenzG50m",null,null,null,null,1]
["1.17.0.01.091","St. Gallen Feldschützengesellschaft der Stadt","2362002","45000","Brisa Tais","Ihmor Bullon","Flurhofstrasse 69","9000","St. Gallen","CH","Weiblich","2012-04-30","Aktiv-A G50m","A","LizenzG50m",null,null,null,null,1]
["1.17.0.01.091","St. Gallen Feldschützengesellschaft der Stadt","1060968","29856","Philipp","Jost","Ahornstrasse 26","9200","Gossau SG","CH","Männlich","1985-05-16","Aktiv-A G50m","A","LizenzG50m",null,null,null,null,1]
["1.17.0.01.091","St. Gallen Feldschützengesellschaft der Stadt","1232566","284493","Karin","Jost","Ahornstrasse 26","9200","Gossau SG","CH","Weiblich","1991-11-05","Aktiv-A G50m","A","LizenzG50m",null,null,null,null,1]
["1.17.0.01.091","St. Gallen Feldschützengesellschaft der Stadt","1061483","113398","Sepp","Lang","Forrenböhlstr. 15","9050","Appenzell","CH","Männlich","1953-07-12","Aktiv-A G50m","A","LizenzG50m",null,null,null,null,1]
["1.17.0.01.091","St. Gallen Feldschützengesellschaft der Stadt","1828226","905666","Astrid","Meier","Brugg 4900","9100","Herisau","CH","Weiblich","2002-09-17","Aktiv-A G50m","A","LizenzG50m",null,null,null,null,1]
["1.17.0.01.091","St. Gallen Feldschützengesellschaft der Stadt","1061359","113274","Bruno","Müller","Im Grund 16a","9012","St. Gallen","CH","Männlich","1953-07-08","Aktiv-A G50m","A","LizenzG50m",null,null,null,null,1]
["1.17.0.01.091","St. Gallen Feldschützengesellschaft der Stadt","1061361","113276","Fridolin","Nauer","Auwiesenstr. 30","9030","Abtwil SG","CH","Männlich","1959-10-21","Aktiv-A G50m","A","LizenzG50m",null,null,null,null,1]
["1.17.0.01.091","St. Gallen Feldschützengesellschaft der Stadt","1027736","4361","Michel","Patt","Lehnhaldenstr. 21","9014","St. Gallen","CH","Männlich","2009-01-20","Aktiv-A G50m","A","LizenzG50m",null,null,null,null,1]
["1.17.0.01.091","St. Gallen Feldschützengesellschaft der Stadt","1136573","188493","Hannes","Patt","Lehnhaldenstr.21","9014","St. Gallen","CH","Männlich","1972-04-05","Aktiv-A G50m","A","LizenzG50m",null,null,null,null,1]
["1.17.0.01.091","St. Gallen Feldschützengesellschaft der Stadt","1855089","933549","Andrea","Patt","Lehnhaldenstr. 21","9014","St. Gallen","CH","Männlich","2006-12-19","Aktiv-A G50m","A","LizenzG50m",null,null,null,null,1]
["1.17.0.01.091","St. Gallen Feldschützengesellschaft der Stadt","1051102","103016","Heinz","Rusch","Sommertalhöhe 866","9103","Schwellbrunn","CH","Männlich","1966-05-16","Aktiv-A G50m","A","LizenzG50m",null,null,null,null,1]
["1.17.0.01.091","St. Gallen Feldschützengesellschaft der Stadt","1243859","295786","Barbara","Schläpfer","Oberzwislen 2a","9056","Gais","CH","Weiblich","1993-01-06","Aktiv-A G50m","A","LizenzG50m",null,null,null,null,1]
["1.17.0.01.091","St. Gallen Feldschützengesellschaft der Stadt","1675922","742528","Reto","Schudel","Tutilostr. 43","9011","St. Gallen","CH","Männlich","1977-08-25","Aktiv-A G50m","A","LizenzG50m",null,null,null,null,1]
["1.17.0.01.091","St. Gallen Feldschützengesellschaft der Stadt","1061362","113277","Fritz","Schäfer","Lessingstr. 43","9008","St. Gallen","CH","Männlich","1968-01-27","Aktiv-A G50m","A","LizenzG50m",null,null,null,null,1]
["1.17.0.01.091","St. Gallen Feldschützengesellschaft der Stadt","1061366","113281","Horst","Steimer","Guisanstr. 45","9010","St. Gallen","CH","Männlich","1939-09-01","Aktiv-A G50m","A","LizenzG50m",null,null,null,null,1]
["1.17.0.01.091","St. Gallen Feldschützengesellschaft der Stadt","2362004","45002","Luuk","Wüst","Neuhofweg 20","9015","St. Gallen","CH","Männlich","2011-01-03","Aktiv-A G50m","A","LizenzG50m",null,null,null,null,1]
["1.44.0.00.053","Wolfhalden Sportschützen","1061535","113450","Elmar","Alder","Aeschi 509","9428","Walzenhausen","CH","Männlich","1956-10-13","Aktiv-A G50m","A","LizenzG50m",null,null,null,null,1]
["1.44.0.00.053","Wolfhalden Sportschützen","1061376","113291","Hans-Peter","Hauser","Pappelstr. 13","9434","Au SG","CH","Männlich","1947-06-23","Aktiv-A G50m","A","LizenzG50m",null,null,null,null,1]
["1.44.0.00.053","Wolfhalden Sportschützen","1061540","113455","Carl","Kamber","Toniwisweg 6","9443","Widnau","CH","Männlich","1956-01-16","Aktiv-A G50m","A","LizenzG50m",null,null,null,null,1]
["1.44.0.00.053","Wolfhalden Sportschützen","1063555","115470","Walter","Kast","Neugasse 3a","9442","Berneck","CH","Männlich","1962-06-21","Aktiv-A G50m","A","LizenzG50m",null,null,null,null,1]
["1.44.0.00.053","Wolfhalden Sportschützen","1061542","113457","Ralph","Künzler","Obstgartenweg 7","9442","Berneck","CH","Männlich","1982-08-16","Aktiv-A G50m","A","LizenzG50m",null,null,null,null,1]
["1.44.0.00.053","Wolfhalden Sportschützen","1060664","112579","Serge","Looser","Nebengrabenstr. 27","9430","St. Margrethen SG","CH","Männlich","1979-12-12","Aktiv-A G50m","A","LizenzG50m",null,null,null,null,1]
["1.44.0.00.053","Wolfhalden Sportschützen","1174378","226303","Richard","Probst","Kellenberg 471","9410","Heiden","CH","Männlich","1985-05-13","Aktiv-A G50m","A","LizenzG50m",null,null,null,null,1]
["1.44.0.00.053","Wolfhalden Sportschützen","2355831","44154","Claude","Vanderstraeten","Kübachstrasse","9442","Berneck","CH","Männlich","1973-06-20","Aktiv-A G50m","A","LizenzG50m",null,null,null,null,1]
["1.44.0.00.053","Wolfhalden Sportschützen","1094468","146385","Lukas","Walser","Torfneststr. 5","9413","Oberegg","CH","Männlich","1989-02-25","Aktiv-A G50m","A","LizenzG50m",null,null,null,null,1]
["1.44.0.00.053","Wolfhalden Sportschützen","1873381","952827","Muriel","Wernli","Leuchen 427","9428","Walzenhausen","CH","Weiblich","1957-01-13","Aktiv-A G50m","A","LizenzG50m",null,null,null,null,1]
["1.44.0.00.053","Wolfhalden Sportschützen","1830905","908501","Markus","Wernli","Leuchen 427","9428","Walzenhausen","CH","Männlich","1955-11-23","Aktiv-A G50m","A","LizenzG50m",null,null,null,null,1]
["1.44.0.00.001","Altstätten Sportschützen","1061056","112971","Christof","Eugster","Langackerweg 2","9450","Altstätten SG","CH","Männlich","1980-08-22","Aktiv-A G50m","A","LizenzG50m",null,null,null,null,2]
["1.44.0.00.001","Altstätten Sportschützen","1061058","112973","Ramona","Eugster","Birkenstr. 9","9463","Oberriet SG","CH","Weiblich","1983-07-19","Aktiv-A G50m","A","LizenzG50m",null,null,null,null,2]
["1.44.0.00.001","Altstätten Sportschützen","1061062","112977","Ronny","Graf","Gräflibüehlstrasse 1","9445","Rebstein","CH","Männlich","1974-06-27","Aktiv-A G50m","A","LizenzG50m",null,null,null,null,2]
["1.44.0.00.001","Altstätten Sportschützen","1096157","148074","Roland","Graf","Rebbergstr. 13","9445","Rebstein","CH","Männlich","1961-05-24","Aktiv-A G50m","A","LizenzG50m",null,null,null,null,2]
["1.44.0.00.001","Altstätten Sportschützen","1079572","131488","Valentin","Koch","Moosweg 2","9445","Rebstein","CH","Männlich","1953-06-25","Aktiv-A G50m","A","LizenzG50m",null,null,null,null,2]
["1.44.0.00.001","Altstätten Sportschützen","1857020","935555","Jenny","Mosch","Hub 17","9463","Oberriet SG","CH","Weiblich","2006-03-07","Aktiv-A G50m","A","LizenzG50m",null,null,null,null,2]
["1.44.0.00.001","Altstätten Sportschützen","1061074","112989","Walter","Nüesch","Nelkenstr. 205","9435","Heerbrugg","CH","Männlich","1941-07-31","Aktiv-A G50m","A","LizenzG50m",null,null,null,null,2]
["1.44.0.00.001","Altstätten Sportschützen","1798294","873906","Nando","Segmüller","Harztannenstr. 3","9450","Altstätten","CH","Männlich","2003-12-07","Aktiv-A G50m","A","LizenzG50m",null,null,null,null,2]
["1.44.0.00.001","Altstätten Sportschützen","1024904","1504","Joe","Segmüller","Harztannenstr. 3","9450","Altstätten SG","CH","Männlich","2010-02-16","Aktiv-A G50m","A","LizenzG50m",null,null,null,null,2]
["1.44.0.00.001","Altstätten Sportschützen","1060672","112587","Rudolf","Wetli","Hintere Kobelstr. 1a","9442","Berneck","CH","Männlich","1951-02-14","Aktiv-A G50m","A","LizenzG50m",null,null,null,null,2]
["1.44.0.00.001","Altstätten Sportschützen","1071270","123186","Andreas","Widmer","Birkenstr. 9","9463","Oberriet SG","CH","Männlich","1983-09-22","Aktiv-A G50m","A","LizenzG50m",null,null,null,null,2]
["1.44.0.00.050","Weissbad Sportschützen","1060680","112595","Adolf","Dobler","Schulhausstr. 5","9057","Schwende","CH","Männlich","1957-05-22","Aktiv-A G50m","A","LizenzG50m",null,null,null,null,2]
["1.44.0.00.050","Weissbad Sportschützen","1060681","112596","Josef","Ebneter","Schützenstr. 2","9320","Arbon","CH","Männlich","1960-07-03","Aktiv-A G50m","A","LizenzG50m",null,null,null,null,2]
["1.44.0.00.050","Weissbad Sportschützen","2360606","44772","Felix","Feiss","Forrenstrasse 15","9050","Appenzell","CH","Männlich","2015-12-19","Aktiv-A G50m","A","LizenzG50m",null,null,null,null,2]
["1.44.0.00.050","Weissbad Sportschützen","2380551","51557","Robin","Fritsche","Leugangenstrasse 8","9057","Weissbad","CH","Männlich","2017-10-07","Aktiv-A G50m","A","LizenzG50m",null,null,null,null,2]
["1.44.0.00.050","Weissbad Sportschützen","1061481","113396","Urs","Fuster","unteres Ziel 3","9050","Appenzell","CH","Männlich","1953-08-10","Aktiv-A G50m","A","LizenzG50m",null,null,null,null,2]
["1.44.0.00.050","Weissbad Sportschützen","1650547","715215","Simon","Gmünder","Möserwies 21","9050","Appenzell Eggerstanden","CH","Männlich","2003-05-08","Aktiv-A G50m","A","LizenzG50m",null,null,null,null,2]
["1.44.0.00.050","Weissbad Sportschützen","1786926","861624","Ralf","Gmünder","Möserwies 21","9050","Appenzell Eggerstanden","CH","Männlich","2005-01-07","Aktiv-A G50m","A","LizenzG50m",null,null,null,null,2]
["1.44.0.00.050","Weissbad Sportschützen","2383429","52090","Livia","Hobi","Egglistrasse 8","9050","Appenzell Steinegg","CH","Weiblich","2013-10-12","Aktiv-A G50m","A","LizenzG50m",null,null,null,null,2]
["1.44.0.00.050","Weissbad Sportschützen","1222328","274255","Manuel Ramon","Inauen","Obere Hirschbergstrasse 12","9050","Appenzell","CH","Männlich","1987-09-23","Aktiv-A G50m","A","LizenzG50m",null,null,null,null,2]
["1.44.0.00.050","Weissbad Sportschützen","2361518","44901","Ben","Knechtle","Leugangenstrasse 6","9057","Weissbad","CH","Männlich","2016-07-08","Aktiv-A G50m","A","LizenzG50m",null,null,null,null,2]
["1.44.0.00.050","Weissbad Sportschützen","1029976","6641","Leandro","Koch","Böhlisjockes 2","9057","Weissbad","CH","Männlich","2012-08-01","Aktiv-A G50m","A","LizenzG50m",null,null,null,null,2]
["1.44.0.00.050","Weissbad Sportschützen","1060685","112600","Emil","Koster","Gaiserstrasse 109","9050","Appenzell Meistersrüte","CH","Männlich","1959-03-06","Aktiv-A G50m","A","LizenzG50m",null,null,null,null,2]
["1.44.0.00.050","Weissbad Sportschützen","1802002","877814","Livio","Locher","Sonneggstrasse 1","9100","Herisau","CH","Männlich","2002-10-08","Aktiv-A G50m","A","LizenzG50m",null,null,null,null,2]
["1.44.0.00.050","Weissbad Sportschützen","1060687","112602","Christian","Manser","Bilchenstr. 17","9050","Appenzell Eggerstanden","CH","Männlich","1983-11-30","Aktiv-A G50m","A","LizenzG50m",null,null,null,null,2]
["1.44.0.00.050","Weissbad Sportschützen","2207680","5491","Noel","Manser","Böhlisjockes 7","9057","Weissbad","CH","Männlich","2011-03-09","Aktiv-A G50m","A","LizenzG50m",null,null,null,null,2]
["1.44.0.00.050","Weissbad Sportschützen","2271189","30358","Leon","Manser","Böhlisjockes 3","9057","Weissbad","CH","Männlich","2012-11-02","Aktiv-A G50m","A","LizenzG50m",null,null,null,null,2]
["1.44.0.00.050","Weissbad Sportschützen","1873643","953115","Jonas","Manser","Rütistr. 47","9050","Appenzell","CH","Männlich","2006-09-19","Aktiv-A G50m","A","LizenzG50m",null,null,null,null,2]
["1.44.0.00.050","Weissbad Sportschützen","1088528","140445","Silvio","Messmer","Schönenbüel  31","9050","Appenzell Steinegg","CH","Männlich","1981-10-15","Aktiv-A G50m","A","LizenzG50m",null,null,null,null,2]
["1.44.0.00.050","Weissbad Sportschützen","1723008","793383","Adrian","Rusch","Bäbelers 18","9050","Appenzell Steinegg","CH","Männlich","2001-10-10","Aktiv-A G50m","A","LizenzG50m",null,null,null,null,2]
["1.44.0.00.050","Weissbad Sportschützen","1060697","112612","Marco","Sonderer","Gaiserstr. 25","9050","Appenzell","CH","Männlich","1979-07-20","Aktiv-A G50m","A","LizenzG50m",null,null,null,null,2]
["1.44.0.00.050","Weissbad Sportschützen","2212455","30357","Maurus","Sonderer","Gaiserstr. 25","9050","Appenzell","CH","Männlich","2012-05-15","Aktiv-A G50m","A","LizenzG50m",null,null,null,null,2]
["1.44.0.00.050","Weissbad Sportschützen","1060700","112615","René","Streule","Lauftenstrasse 4","9050","Appenzell","CH","Männlich","1957-03-05","Aktiv-A G50m","A","LizenzG50m",null,null,null,null,2]
["1.44.0.00.050","Weissbad Sportschützen","1238283","290210","Martin","Streule","Egglistrasse 8","9050","Appenzell Steinegg","CH","Männlich","1990-01-12","Aktiv-A G50m","A","LizenzG50m",null,null,null,null,2]
["1.44.0.00.050","Weissbad Sportschützen","1758221","830924","Sven","Städler","Unteres Ziel 5","9050","Appenzell","CH","Männlich","2003-12-04","Aktiv-A G50m","A","LizenzG50m",null,null,null,null,2]
["1.44.0.00.050","Weissbad Sportschützen","2326375","41429","Fabio","Sutter","obere Hirschbergstrasse 12","9050","Appenzell","CH","Männlich","2013-09-09","Aktiv-A G50m","A","LizenzG50m",null,null,null,null,2]
["1.44.0.00.050","Weissbad Sportschützen","2360605","44771","Lenny","Trauter","Gächtenstrasse 4","9050","Appenzell","CH","Männlich","2016-07-22","Aktiv-A G50m","A","LizenzG50m",null,null,null,null,2]
["1.44.0.00.050","Weissbad Sportschützen","1758222","830925","Jan","Ulmann","Gaiserstrasse 196","9050","Appenzell Meistersrüte","CH","Männlich","2003-10-19","Aktiv-A G50m","A","LizenzG50m",null,null,null,null,2]
["1.44.0.00.050","Weissbad Sportschützen","2383423","52086","Yanis","Vock","Schwendestrasse 11","9057","Weissbad","CH","Männlich","2015-05-17","Aktiv-A G50m","A","LizenzG50m",null,null,null,null,2]
["1.44.0.00.050","Weissbad Sportschützen","1060705","112620","Patrick","Wetter","Zistli 4","9050","Appenzell Steinegg","CH","Männlich","1984-10-15","Aktiv-A G50m","A","LizenzG50m",null,null,null,null,2]
["1.44.0.00.050","Weissbad Sportschützen","2360608","44774","Lukas","Wild","Schwendetalstrasse 97","9057","Wasserauen","CH","Männlich","2016-01-24","Aktiv-A G50m","A","LizenzG50m",null,null,null,null,2]
["1.17.0.05.016","Buchs-Räfis Schützengesellschaft","1725211","795828","Gregor Jan","Dubielczyk","Bergersguet 2","9465","Salez","CH","Männlich","1988-01-10","Aktiv-A G50m","A","LizenzG50m",null,null,null,null,3]
["1.17.0.05.016","Buchs-Räfis Schützengesellschaft","1258976","310904","Christoph","Dürr","Hueb 13","9473","Gams","CH","Männlich","1996-04-28","Aktiv-B G50m","B","LizenzG50m",null,null,null,null,3]
["1.17.0.05.016","Buchs-Räfis Schützengesellschaft","1874890","954441","Pascal","Gangl","Birkenweg 6","9494","Schaan","LI","Männlich","1988-04-12","Aktiv-A G50m","A","LizenzG50m",null,null,null,null,3]
["1.17.0.05.016","Buchs-Räfis Schützengesellschaft","1061610","113525","Hermann","Gassner","Landstr. 168","9495","Triesen","LI","Männlich","1948-12-06","Aktiv-A G50m","A","LizenzG50m",null,null,null,null,3]
["1.17.0.05.016","Buchs-Räfis Schützengesellschaft","1492091","544371","Lukas","Grassi","Finkenweg 9","9463","Oberriet SG","CH","Männlich","1992-06-15","Aktiv-A G50m","A","LizenzG50m",null,null,null,null,3]
["1.17.0.05.016","Buchs-Räfis Schützengesellschaft","1509313","42470","Josef","Grob","Scalettastrasse 143","7000","Chur","CH","Männlich","2002-10-17","Aktiv-A G50m","A","LizenzG50m",null,null,null,null,3]
["1.17.0.05.016","Buchs-Räfis Schützengesellschaft","1061331","113246","Walter","Hausammann","Schützenweg 31c","9470","Buchs SG","CH","Männlich","1942-06-30","Aktiv-A G50m","A","LizenzG50m",null,null,null,null,3]
["1.17.0.05.016","Buchs-Räfis Schützengesellschaft","1917205","998361","Hanspeter","Lippuner","Volksgartenstr. 42","9470","Buchs SG","CH","Männlich","1961-11-18","Aktiv-A G50m","A","LizenzG50m",null,null,null,null,3]
["1.17.0.05.016","Buchs-Räfis Schützengesellschaft","1762046","27306","Melanie","Lutz","Holderbaum 23","6973","Höchst","AT","Weiblich","1981-08-11","Aktiv-A G50m","A","LizenzG50m",null,null,null,null,3]
["1.17.0.05.016","Buchs-Räfis Schützengesellschaft","1033897","10588","Inola","Mosch","Rahnstr. 14b","9450","Altstätten SG","CH","Weiblich","2008-11-27","Aktiv-A G50m","A","LizenzG50m",null,null,null,null,3]
["1.17.0.05.016","Buchs-Räfis Schützengesellschaft","1029615","6276","Svetlana","Racina","Neugutgrabenstr. 5","9470","Buchs SG","CH","Weiblich","1982-11-26","Aktiv-A G50m","A","LizenzG50m",null,null,null,null,3]
["1.17.0.05.016","Buchs-Räfis Schützengesellschaft","1235879","287806","Andy","Roffler","Altendorferstr. 47","9470","Buchs SG","CH","Männlich","1956-04-21","Aktiv-A G50m","A","LizenzG50m",null,null,null,null,3]
["1.17.0.05.016","Buchs-Räfis Schützengesellschaft","1255292","307220","Cécile","Roffler","Groffeldstrasse 6b","9470","Buchs SG","CH","Weiblich","1992-08-15","Aktiv-A G50m","A","LizenzG50m",null,null,null,null,3]
["1.17.0.05.016","Buchs-Räfis Schützengesellschaft","2357145","44331","Nadine","Roider","Bongerten 43","9492","Eschen","LI","Weiblich","1975-02-27","Aktiv-A G50m","A","LizenzG50m",null,null,null,null,3]
["1.17.0.05.016","Buchs-Räfis Schützengesellschaft","1061017","112932","Mario","Scherrer","Giessenfeld 4","9469","Haag","CH","Männlich","1986-03-05","Aktiv-A G50m","A","LizenzG50m",null,null,null,null,3]
["1.17.0.05.016","Buchs-Räfis Schützengesellschaft","2262119","27305","Arnold","Schrotter","Wimmatweg 16a","6830","Rankweil","AT","Männlich","1968-09-15","Aktiv-A G50m","A","LizenzG50m",null,null,null,null,3]
["1.17.0.05.016","Buchs-Räfis Schützengesellschaft","1061018","112933","Alfred","Sonderegger","Staudnerbergstr. 1","9472","Grabs","CH","Männlich","1954-04-21","Aktiv-B G50m","B","LizenzG50m",null,null,null,null,3]
["1.17.0.05.016","Buchs-Räfis Schützengesellschaft","1548340","609240","Tughan","Telatar","Bahnhofstr. 37","9475","Sevelen","CH","Männlich","1976-05-14","Aktiv-A G50m","A","LizenzG50m",null,null,null,null,3]
["1.17.0.05.016","Buchs-Räfis Schützengesellschaft","2301196","32514","Galiya","Valieva","Wetti 45","9470","Buchs SG","CH","Weiblich","1962-02-05","Aktiv-A G50m","A","LizenzG50m",null,null,null,null,3]
["1.17.0.05.016","Buchs-Räfis Schützengesellschaft","1720612","790659","Lorena","Vanoni","Palduinstr. 26","9496","Balzers","LI","Weiblich","2002-09-25","Aktiv-A G50m","A","LizenzG50m",null,null,null,null,3]
["1.17.0.05.016","Buchs-Räfis Schützengesellschaft","1699307","767500","Larissa","Vanoni","Palduinstr. 26","9496","Balzers","LI","Weiblich","1999-08-03","Aktiv-A G50m","A","LizenzG50m",null,null,null,null,3]
["1.17.0.05.016","Buchs-Räfis Schützengesellschaft","2329574","44903","Anna","Vybostok","Madweg 4","9467","Frümsen","CH","Weiblich","1975-07-20","Aktiv-A G50m","A","LizenzG50m",null,null,null,null,3]
["1.17.0.05.016","Buchs-Räfis Schützengesellschaft","2212679","6464","Marian","Weissschuh","Balgacherstrasse 9","9445","Rebstein","CH","Männlich","1993-03-01","Aktiv-A G50m","A","LizenzG50m",null,null,null,null,3]
["1.17.0.05.016","Buchs-Räfis Schützengesellschaft","1112824","164742","Beat","Widmer","Unt. Fuchsrainstr. 4a","4313","Möhlin","CH","Männlich","1961-11-30","Aktiv-B G50m","B","LizenzG50m",null,null,null,null,3]
["1.17.0.05.016","Buchs-Räfis Schützengesellschaft","1087452","139369","Thomas","Willi","Feldgass 6","9478","Azmoos","CH","Männlich","1966-07-15","Aktiv-A G50m","A","LizenzG50m",null,null,null,null,3]
["1.17.0.05.016","Buchs-Räfis Schützengesellschaft","1026456","3065","Manfred","Zaisberger","Auring 2","9490","Vaduz","LI","Männlich","1962-09-07","Aktiv-A G50m","A","LizenzG50m",null,null,null,null,3]
["1.17.0.05.016","Buchs-Räfis Schützengesellschaft","2314378","36933","David","de Kock","Gätterweg 7","9494","Schaan","LI","Männlich","1967-03-18","Aktiv-A G50m","A","LizenzG50m",null,null,null,null,3]
["1.44.0.00.017","Grabs Sportschützen","1874479","954010","Raffael","Eggenberger","Dorfstrasse 8","9472","Grabs","CH","Männlich","2007-12-11","Aktiv-A G50m","A","LizenzG50m",null,null,null,null,3]
["1.44.0.00.017","Grabs Sportschützen","1795379","870791","Nico","Fuchs","Stockenhofstrasse 8","9472","Grabs","CH","Männlich","2003-09-20","Aktiv-A G50m","A","LizenzG50m",null,null,null,null,3]
["1.44.0.00.017","Grabs Sportschützen","1060995","112910","Patrick","Gadient","Feldeggstr. 5","9470","Buchs SG","CH","Männlich","1977-10-14","Aktiv-A G50m","A","LizenzG50m",null,null,null,null,3]
["1.44.0.00.017","Grabs Sportschützen","1619955","682582","Marlies","Kaiser","Wiedenstr. 40","9470","Buchs","CH","Weiblich","1999-04-29","Aktiv-A G50m","A","LizenzG50m",null,null,null,null,3]
["1.44.0.00.017","Grabs Sportschützen","1477535","529472","Martina","Kaiser","Wiedenstrasse 40","9470","Buchs SG","CH","Weiblich","1996-03-15","Aktiv-A G50m","A","LizenzG50m",null,null,null,null,3]
["1.44.0.00.017","Grabs Sportschützen","1258977","310905","Michael","Kaiser","Möösli 24","9473","Gams","CH","Männlich","1994-08-12","Aktiv-A G50m","A","LizenzG50m",null,null,null,null,3]
["1.44.0.00.017","Grabs Sportschützen","1252854","304782","René","Kaiser","Unterer Schleipfweg 12","9473","Gams","CH","Männlich","1997-11-05","Aktiv-A G50m","A","LizenzG50m",null,null,null,null,3]
["1.44.0.00.017","Grabs Sportschützen","1344848","396780","Flurin","Kressig","Wiedenstrasse 40","9470","Buchs SG","CH","Männlich","1999-02-27","Aktiv-A G50m","A","LizenzG50m",null,null,null,null,3]
["1.44.0.00.017","Grabs Sportschützen","1087074","138991","Jan","Kressig","Giessenstr. 5a","9469","Haag (Rheintal)","CH","Männlich","1988-05-04","Aktiv-A G50m","A","LizenzG50m",null,null,null,null,3]
["1.44.0.00.017","Grabs Sportschützen","1888730","968886","Josipa","Matanovic","Schützenweg 13","9470","Buchs SG","CH","Weiblich","2007-03-03","Aktiv-A G50m","A","LizenzG50m",null,null,null,null,3]
["1.44.0.00.017","Grabs Sportschützen","1061001","112916","Arinette","Moser","Taletze 26","9496","Balzers","LI","Weiblich","1968-09-27","Aktiv-A G50m","A","LizenzG50m",null,null,null,null,3]
["1.44.0.00.017","Grabs Sportschützen","1235879","287806","Andy","Roffler","Altendorferstr. 47","9470","Buchs SG","CH","Männlich","1956-04-21","Aktiv-B G50m","B","LizenzG50m",null,null,null,null,3]
["1.44.0.00.017","Grabs Sportschützen","1061017","112932","Mario","Scherrer","Giessenfeld 4","9469","Haag","CH","Männlich","1986-03-05","Aktiv-B G50m","B","LizenzG50m",null,null,null,null,3]
["1.44.0.00.017","Grabs Sportschützen","1061018","112933","Alfred","Sonderegger","Staudnerbergstr. 1","9472","Grabs","CH","Männlich","1954-04-21","Aktiv-A G50m","A","LizenzG50m",null,null,null,null,3]
["1.44.0.00.017","Grabs Sportschützen","1061022","112937","Armin","Spichtig","Leestrasse 5","9658","Wildhaus","CH","Männlich","1961-07-05","Aktiv-B G50m","B","LizenzG50m",null,null,null,null,3]
["1.44.0.00.017","Grabs Sportschützen","1035019","11718","Mia","Wichser","Oberbühl 26","9498","Planken","LI","Weiblich","2009-11-11","Aktiv-A G50m","A","LizenzG50m",null,null,null,null,3]
["1.44.0.00.052","Wildhaus Sportschützen","1061524","113439","Claudia","Brauchli","Untere Riethaldenstr. 6","9658","Wildhaus","CH","Weiblich","1975-01-21","Aktiv-A G50m","A","LizenzG50m",null,null,null,null,3]
["1.44.0.00.052","Wildhaus Sportschützen","1715257","784623","Selin","Brauchli","Untere Riethaldenstr. 6","9658","Wildhaus","CH","Weiblich","2002-05-06","Aktiv-A G50m","A","LizenzG50m",null,null,null,null,3]
["1.44.0.00.052","Wildhaus Sportschützen","1061525","113440","Hans","Brauchli","Untere Riethaldenstr. 6","9658","Wildhaus","CH","Männlich","1971-10-27","Aktiv-A G50m","A","LizenzG50m",null,null,null,null,3]
["1.44.0.00.052","Wildhaus Sportschützen","2323900","40844","Jack","Church","Büchelstrasse 16","9658","Wildhaus","CH","Männlich","1960-07-05","Aktiv-A G50m","A","LizenzG50m",null,null,null,null,3]
["1.44.0.00.052","Wildhaus Sportschützen","1061526","113441","Bruno","Forrer","Vordere Schwendistr. 12","9658","Wildhaus","CH","Männlich","1981-11-11","Aktiv-A G50m","A","LizenzG50m",null,null,null,null,3]
["1.44.0.00.052","Wildhaus Sportschützen","1025024","1625","Jan","Moser","Oberdorf 1924","9643","Krummenau","CH","Männlich","2007-12-10","Aktiv-A G50m","A","LizenzG50m",null,null,null,null,3]
["1.44.0.00.052","Wildhaus Sportschützen","1900794","981492","Damian","Oehler","Brüch 2358","9472","Grabserberg","CH","Männlich","2008-02-17","Aktiv-A G50m","A","LizenzG50m",null,null,null,null,3]
["1.44.0.00.052","Wildhaus Sportschützen","1061022","112937","Armin","Spichtig","Leestrasse 5","9658","Wildhaus","CH","Männlich","1961-07-05","Aktiv-B G50m","B","LizenzG50m",null,null,null,null,3]
["1.44.0.00.052","Wildhaus Sportschützen","1112824","164742","Beat","Widmer","Unt. Fuchsrainstr. 4a","4313","Möhlin","CH","Männlich","1961-11-30","Aktiv-A G50m","A","LizenzG50m",null,null,null,null,3]
["1.44.0.00.059","Vaduz Sportschützen","1035822","12527","Matthias","Amann","Wuhrstr. 7","9490","Vaduz","LI","Männlich","1980-02-25","Aktiv-A G50m","A","LizenzG50m",null,null,null,null,3]
["1.44.0.00.059","Vaduz Sportschützen","1061623","113538","Peter","Bargetze","Feldstr. 36","9495","Triesen","LI","Männlich","1962-12-20","Aktiv-A G50m","A","LizenzG50m",null,null,null,null,3]
["1.44.0.00.059","Vaduz Sportschützen","1061624","113539","Otto","Büchel","Unterm Schloss 80","9496","Balzers","LI","Männlich","1939-12-09","Aktiv-A G50m","A","LizenzG50m",null,null,null,null,3]
["1.44.0.00.059","Vaduz Sportschützen","1870315","949648","Patrick","Büchel","Mühlegasse 69","9486","Schaanwald","LI","Männlich","1997-02-19","Aktiv-A G50m","A","LizenzG50m",null,null,null,null,3]
["1.44.0.00.059","Vaduz Sportschützen","2323370","40725","Merjem","Dogic","Guferastrasse 12","9477","Trübbach","CH","Weiblich","2003-01-12","Aktiv-A G50m","A","LizenzG50m",null,null,null,null,3]
["1.44.0.00.059","Vaduz Sportschützen","1061625","113540","Hans","Domenig","Felbenweg 2","9493","Mauren FL","LI","Männlich","1947-04-08","Aktiv-A G50m","A","LizenzG50m",null,null,null,null,3]
["1.44.0.00.059","Vaduz Sportschützen","1736582","807741","Johannes","Egger","Finne 24","9496","Balzers","LI","Männlich","1971-04-22","Aktiv-A G50m","A","LizenzG50m",null,null,null,null,3]
["1.44.0.00.059","Vaduz Sportschützen","1061628","51092","Karl","Frommelt","Oberguferstr 33","9497","Triesenberg","LI","Männlich","1961-04-11","Aktiv-A G50m","A","LizenzG50m",null,null,null,null,3]
["1.44.0.00.059","Vaduz Sportschützen","1216506","268433","Stephan","Hoop","Delehala 22","9493","Mauren FL","LI","Männlich","1989-10-11","Aktiv-A G50m","A","LizenzG50m",null,null,null,null,3]
["1.44.0.00.059","Vaduz Sportschützen","1217150","269077","Gustav","Kaufmann","Tanzplatz 6","9494","Schaan","LI","Männlich","1956-04-20","Aktiv-A G50m","A","LizenzG50m",null,null,null,null,3]
["1.44.0.00.059","Vaduz Sportschützen","1061632","113547","Dietmar","Kindle","Feldstr. 15","9495","Triesen","LI","Männlich","1951-12-21","Aktiv-A G50m","A","LizenzG50m",null,null,null,null,3]
["1.44.0.00.059","Vaduz Sportschützen","1223513","275440","Tatjana","Kolzoff","Landstr. 274","9495","Triesen","LI","Weiblich","1987-08-16","Aktiv-A G50m","A","LizenzG50m",null,null,null,null,3]
["1.44.0.00.059","Vaduz Sportschützen","1801399","877196","Kay","Monz","Rötis 13","9492","Eschen","LI","Männlich","1984-08-27","Aktiv-A G50m","A","LizenzG50m",null,null,null,null,3]
["1.44.0.00.059","Vaduz Sportschützen","2340142","42003","Daniel","Reichsöllner","Steinortstrasse 2","9497","Triesenberg","LI","Männlich","1989-09-21","Aktiv-A G50m","A","LizenzG50m",null,null,null,null,3]
["1.44.0.00.059","Vaduz Sportschützen","1758264","830981","Iordanis","Telidis","Hegastr. 63","9497","Triesenberg","LI","Männlich","1979-07-14","Aktiv-A G50m","A","LizenzG50m",null,null,null,null,3]
["1.17.0.06.080","Sargans Schützenverein","2343025","42512","Almir","Ahmeti","leglingen 2","7320","Sargans","CH","Männlich","2009-08-21","Aktiv-A G50m","A","LizenzG50m",null,null,null,null,4]
["1.17.0.06.080","Sargans Schützenverein","2219815","9244","Xhemail","Ahmeti","Legglingen 2","7320","Sargans","CH","Männlich","2007-01-28","Aktiv-A G50m","A","LizenzG50m",null,null,null,null,4]
["1.17.0.06.080","Sargans Schützenverein","1743338","814742","Timon","Bartholet","Gasenzenstrasse 12","9473","Gams","CH","Männlich","2004-06-11","Aktiv-A G50m","A","LizenzG50m",null,null,null,null,4]
["1.17.0.06.080","Sargans Schützenverein","1499932","552212","Joëlle Pascale","Baumgartner","Floraweg 5","7310","Bad Ragaz","CH","Weiblich","1994-02-06","Aktiv-A G50m","A","LizenzG50m",null,null,null,null,4]
["1.17.0.06.080","Sargans Schützenverein","1061255","113170","Thomas","Bieri","Töbeliweg 4","7320","Sargans","CH","Männlich","1989-02-03","Aktiv-A G50m","A","LizenzG50m",null,null,null,null,4]
["1.17.0.06.080","Sargans Schützenverein","1077390","129306","Erhard","Bieri","Töbeliweg 4","7320","Sargans","CH","Männlich","1945-06-04","Aktiv-A G50m","A","LizenzG50m",null,null,null,null,4]
["1.17.0.06.080","Sargans Schützenverein","2252734","15764","Stella","Donau","Staatsstr. 77","8888","Heiligkreuz (Mels)","CH","Weiblich","2015-02-22","Aktiv-A G50m","A","LizenzG50m",null,null,null,null,4]
["1.17.0.06.080","Sargans Schützenverein","1058387","110302","Brigitte","Egli","Annabergstr. 7","8882","Unterterzen","CH","Weiblich","1968-05-04","Aktiv-A G50m","A","LizenzG50m",null,null,null,null,4]
["1.17.0.06.080","Sargans Schützenverein","1205331","257257","Reto","Frey","Vilterserstr. 20","7323","Wangs","CH","Männlich","1971-02-20","Aktiv-A G50m","A","LizenzG50m",null,null,null,null,4]
["1.17.0.06.080","Sargans Schützenverein","1205434","257360","Patrick","Good","Churfirstenweg 5","7324","Vilters","CH","Männlich","1982-03-16","Aktiv-A G50m","A","LizenzG50m",null,null,null,null,4]
["1.17.0.06.080","Sargans Schützenverein","1869851","949160","Cedric","Good","Rosenstr. 15A","7320","Sargans","CH","Männlich","2009-01-18","Aktiv-A G50m","A","LizenzG50m",null,null,null,null,4]
["1.17.0.06.080","Sargans Schützenverein","1257035","308963","Sandro","Greuter","Im Stoffel 15","8887","Mels","CH","Männlich","1993-02-25","Aktiv-A G50m","A","LizenzG50m",null,null,null,null,4]
["1.17.0.06.080","Sargans Schützenverein","1061261","113176","Paul","Hermann","Ragazerstr. 40","7320","Sargans","CH","Männlich","1936-07-29","Aktiv-A G50m","A","LizenzG50m",null,null,null,null,4]
["1.17.0.06.080","Sargans Schützenverein","2266124","29198","Arjen","Holler","Gonzenstrasse 22","9475","Sevelen","CH","Männlich","2014-07-08","Aktiv-A G50m","A","LizenzG50m",null,null,null,null,4]
["1.17.0.06.080","Sargans Schützenverein","1061265","113180","Stefan","Jäger","Rosengasse 17","7324","Vilters","CH","Männlich","1986-06-05","Aktiv-A G50m","A","LizenzG50m",null,null,null,null,4]
["1.17.0.06.080","Sargans Schützenverein","1682075","749157","Celine","Kalberer","Bleesstr. 5","8887","Mels","CH","Weiblich","1999-11-17","Aktiv-A G50m","A","LizenzG50m",null,null,null,null,4]
["1.17.0.06.080","Sargans Schützenverein","2304925","33937","Mira","Kuzmina","Schmittenstrasse 3","8892","Berschis","CH","Weiblich","2013-07-28","Aktiv-A G50m","A","LizenzG50m",null,null,null,null,4]
["1.17.0.06.080","Sargans Schützenverein","1254193","306121","Michael","Köppel","Efeuweg 1","7310","Bad Ragaz","CH","Männlich","1996-01-16","Aktiv-A G50m","A","LizenzG50m",null,null,null,null,4]
["1.17.0.06.080","Sargans Schützenverein","1878938","958697","Zsombor","Lengyel","Leginglen 7","7320","Sargans","CH","Männlich","2006-09-02","Aktiv-A G50m","A","LizenzG50m",null,null,null,null,4]
["1.17.0.06.080","Sargans Schützenverein","1061010","112925","Roger","Lenherr","Neufeld 21","9473","Gams","CH","Männlich","1982-07-14","Aktiv-A G50m","A","LizenzG50m",null,null,null,null,4]
["1.17.0.06.080","Sargans Schützenverein","1072680","124596","Robert","Pfiffner","Täliweg 32","8887","Mels","CH","Männlich","1960-02-29","Aktiv-A G50m","A","LizenzG50m",null,null,null,null,4]
["1.17.0.06.080","Sargans Schützenverein","1061017","112932","Mario","Scherrer","Giessenfeld 4","9469","Haag","CH","Männlich","1986-03-05","Aktiv-B G50m","B","LizenzG50m",null,null,null,null,4]
["1.17.0.06.080","Sargans Schützenverein","1083321","135238","Stefan","Scherrer","Mühlegasse 7","8887","Mels","CH","Männlich","1976-12-16","Aktiv-A G50m","A","LizenzG50m",null,null,null,null,4]
["1.17.0.06.080","Sargans Schützenverein","1059892","111807","Daniel","Siegenthaler","Gulerstr. 22b","7320","Sargans","CH","Männlich","1961-10-28","Aktiv-A G50m","A","LizenzG50m",null,null,null,null,4]
["1.17.0.06.080","Sargans Schützenverein","1061284","113199","Remo","Zimmermann","Feldweg 2","7324","Vilters","CH","Männlich","1972-09-01","Aktiv-A G50m","A","LizenzG50m",null,null,null,null,4]
["1.44.0.00.004","Bad Ragaz Kleinkaliberschützen","1060727","112642","Anton","Brunold","Ochsenbrunnen 3","7310","Bad Ragaz","CH","Männlich","1957-05-16","Aktiv-A G50m","A","LizenzG50m",null,null,null,null,4]
["1.44.0.00.004","Bad Ragaz Kleinkaliberschützen","1248288","300215","Dominik","Gort","Taminastr. 30a","7310","Bad Ragaz","CH","Männlich","1988-02-17","Aktiv-A G50m","A","LizenzG50m",null,null,null,null,4]
["1.44.0.00.004","Bad Ragaz Kleinkaliberschützen","1236249","288176","Benjamin","Gort","Aeulistr. 12","7310","Bad Ragaz","CH","Männlich","1989-08-01","Aktiv-A G50m","A","LizenzG50m",null,null,null,null,4]
["1.44.0.00.004","Bad Ragaz Kleinkaliberschützen","1060731","112646","Reto","Lüthi","Vorstadtgasse 31","7304","Maienfeld","CH","Männlich","1980-10-03","Aktiv-A G50m","A","LizenzG50m",null,null,null,null,4]
["1.44.0.00.004","Bad Ragaz Kleinkaliberschützen","1060732","28129","Christian","Mader","Gräfin-Agnes-Str. 5","7320","Sargans","CH","Männlich","1984-01-25","Aktiv-A G50m","A","LizenzG50m",null,null,null,null,4]
["1.44.0.00.004","Bad Ragaz Kleinkaliberschützen","1060733","112648","Markus","Probst","Weiligstr. 30a","7310","Bad Ragaz","CH","Männlich","1958-11-17","Aktiv-A G50m","A","LizenzG50m",null,null,null,null,4]
["1.44.0.00.004","Bad Ragaz Kleinkaliberschützen","1044623","21388","Svetlana","Sidorenko","Kronenplatz 8","7310","Bad Ragaz","CH","Weiblich","1988-09-14","Aktiv-A G50m","A","LizenzG50m",null,null,null,null,4]
["1.44.0.00.004","Bad Ragaz Kleinkaliberschützen","1060736","112651","Josef","Wildhaber","Spitzackerstr. 7","7310","Bad Ragaz","CH","Männlich","1959-09-22","Aktiv-A G50m","A","LizenzG50m",null,null,null,null,4]
["1.44.0.00.027","Mels Kleinkaliberschützen","1061173","113088","Othmar","Bless","Kettweg 1","8880","Walenstadt","CH","Männlich","1946-07-04","Aktiv-A G50m","A","LizenzG50m",null,null,null,null,4]
["1.44.0.00.027","Mels Kleinkaliberschützen","1061174","113089","Roger","Bless","Zwergstr. 8","8890","Flums","CH","Männlich","1975-10-13","Aktiv-A G50m","A","LizenzG50m",null,null,null,null,4]
["1.44.0.00.027","Mels Kleinkaliberschützen","2196281","2134","Martin","Drabik","Rheinstrasse 35","7320","Sargans","CH","Männlich","1981-03-20","Aktiv-A G50m","A","LizenzG50m",null,null,null,null,4]
["1.44.0.00.027","Mels Kleinkaliberschützen","1061176","113091","Roger","Eberle","Rennweg 20","8888","Heiligkreuz (Mels)","CH","Männlich","1976-09-25","Aktiv-A G50m","A","LizenzG50m",null,null,null,null,4]
["1.44.0.00.027","Mels Kleinkaliberschützen","1875854","2123","Maurus","Gantner","Täliweg 43","8887","Mels","CH","Männlich","2006-05-07","Aktiv-A G50m","A","LizenzG50m",null,null,null,null,4]
["1.44.0.00.027","Mels Kleinkaliberschützen","1747854","819757","Andrin","Gantner","","7315","Vättis","CH","Männlich","2001-10-10","Aktiv-A G50m","A","LizenzG50m",null,null,null,null,4]
["1.44.0.00.027","Mels Kleinkaliberschützen","1800368","876121","Jan","Good","Schmelziweg","8889","Plons","CH","Männlich","2004-12-17","Aktiv-A G50m","A","LizenzG50m",null,null,null,null,4]
["1.44.0.00.027","Mels Kleinkaliberschützen","2196287","2162","Til","Guggisberg","untere Mätzwiesenstrasse 2","8897","Flumserberg Tannenheim","CH","Männlich","2008-04-05","Aktiv-A G50m","A","LizenzG50m",null,null,null,null,4]
["1.44.0.00.027","Mels Kleinkaliberschützen","1085493","137410","René","Keller","Hintergasse 5","7312","Pfäfers","CH","Männlich","1969-10-30","Aktiv-A G50m","A","LizenzG50m",null,null,null,null,4]
["1.44.0.00.027","Mels Kleinkaliberschützen","1170180","222105","Stefano","Keller","Tobelgasse 9","7310","Bad Ragaz","CH","Männlich","1973-09-27","Aktiv-A G50m","A","LizenzG50m",null,null,null,null,4]
["1.44.0.00.027","Mels Kleinkaliberschützen","1260180","312108","Manuel","Kurath","Mädriserstrasse 9","8887","Mels","CH","Männlich","1989-05-08","Aktiv-A G50m","A","LizenzG50m",null,null,null,null,4]
["1.44.0.00.027","Mels Kleinkaliberschützen","1078803","130719","Patrick","Meli","Grenzweg 6","8888","Heiligkreuz (Mels)","CH","Männlich","1971-11-26","Aktiv-A G50m","A","LizenzG50m",null,null,null,null,4]
["1.44.0.00.027","Mels Kleinkaliberschützen","1251547","303475","Hanspeter","Meli","Gerbistr. 3","8887","Mels","CH","Männlich","1976-05-23","Aktiv-A G50m","A","LizenzG50m",null,null,null,null,4]
["1.44.0.00.027","Mels Kleinkaliberschützen","1869252","948543","Leandra","Pfiffner","Parfannastr. 41","8887","Mels","CH","Weiblich","2005-04-09","Aktiv-A G50m","A","LizenzG50m",null,null,null,null,4]
["1.44.0.00.027","Mels Kleinkaliberschützen","1078850","130766","Thomas","Pfiffner","Optikweg 7","8887","Mels","CH","Männlich","1974-05-25","Aktiv-A G50m","A","LizenzG50m",null,null,null,null,4]
["1.44.0.00.027","Mels Kleinkaliberschützen","1869253","2144","Orlando","Pfiffner","Parfannastr. 41","8887","Mels","CH","Männlich","2007-01-14","Aktiv-A G50m","A","LizenzG50m",null,null,null,null,4]
["1.44.0.00.027","Mels Kleinkaliberschützen","1869251","2125","Mihajlo","Trubarac","Sarganserstr. 56","8887","Mels","CH","Männlich","2005-08-09","Aktiv-A G50m","A","LizenzG50m",null,null,null,null,4]
["1.44.0.00.027","Mels Kleinkaliberschützen","1898484","2124","Luca","Willi","Winkelstr.32a","8887","Mels","CH","Männlich","2008-07-17","Aktiv-A G50m","A","LizenzG50m",null,null,null,null,4]
["1.44.0.00.027","Mels Kleinkaliberschützen","1747856","819759","Patrick","Willi","Neugutstr. 9","8888","Heiligkreuz (Mels)","CH","Männlich","2000-05-11","Aktiv-A G50m","A","LizenzG50m",null,null,null,null,4]
["1.44.0.00.027","Mels Kleinkaliberschützen","1222355","274282","Matthias","Willi","Zeughaustr. 10","8887","Mels","CH","Männlich","1992-07-26","Aktiv-A G50m","A","LizenzG50m",null,null,null,null,4]
["1.44.0.00.027","Mels Kleinkaliberschützen","1491494","543774","Yaron","Wolfson","Im Stoffel 41","8887","Mels","CH","Männlich","1996-08-28","Aktiv-A G50m","A","LizenzG50m",null,null,null,null,4]
["1.17.0.10.015","Brunnadern Sportschützen Neckertal","1089131","141048","Oliver","Blatter","Tunnelstr. 3","9125","Brunnadern","CH","Männlich","1963-01-13","Aktiv-A G50m","A","LizenzG50m",null,null,null,null,5]
["1.17.0.10.015","Brunnadern Sportschützen Neckertal","1055384","107298","Markus","Brütsch","Rumpf 794","9630","Wattwil","CH","Männlich","1963-04-05","Aktiv-A G50m","A","LizenzG50m",null,null,null,null,5]
["1.17.0.10.015","Brunnadern Sportschützen Neckertal","1129333","181253","Walter","Frei","Böschenbachstr. 9","9122","Mogelsberg","CH","Männlich","1953-06-20","Aktiv-A G50m","A","LizenzG50m",null,null,null,null,5]
["1.17.0.10.015","Brunnadern Sportschützen Neckertal","1089134","141051","Hansruedi","Furrer","Dorfstr. 17","9125","Brunnadern","CH","Männlich","1945-09-10","Aktiv-A G50m","A","LizenzG50m",null,null,null,null,5]
["1.17.0.10.015","Brunnadern Sportschützen Neckertal","2260355","26562","Kevin","Gos","Bachweg 2","9125","Brunnadern","CH","Männlich","2012-12-26","Aktiv-A G50m","A","LizenzG50m",null,null,null,null,5]
["1.17.0.10.015","Brunnadern Sportschützen Neckertal","1910929","991892","Ramon","Herzog","Bunt 18","9127","St. Peterzell","CH","Männlich","2008-11-20","Aktiv-A G50m","A","LizenzG50m",null,null,null,null,5]
["1.17.0.10.015","Brunnadern Sportschützen Neckertal","1225836","277763","Christian","Lusti","Eschenberg 58","9630","Wattwil","CH","Männlich","1989-02-06","Aktiv-A G50m","A","LizenzG50m",null,null,null,null,5]
["1.17.0.10.015","Brunnadern Sportschützen Neckertal","1029846","6511","Remo","Niederer","Stofel 441","9127","St. Peterzell","CH","Männlich","2011-12-30","Aktiv-A G50m","A","LizenzG50m",null,null,null,null,5]
["1.17.0.10.015","Brunnadern Sportschützen Neckertal","1046541","23312","Benjamin","Sandor","Aeschstr. 4","9122","Mogelsberg","CH","Männlich","2012-01-19","Aktiv-A G50m","A","LizenzG50m",null,null,null,null,5]
["1.17.0.10.015","Brunnadern Sportschützen Neckertal","1061454","113369","Urs","Schuler","Schoren 411","9122","Mogelsberg","CH","Männlich","1984-04-21","Aktiv-A G50m","A","LizenzG50m",null,null,null,null,5]
["1.17.0.10.015","Brunnadern Sportschützen Neckertal","1405542","457478","Michael","Schweizer","Strick 580","9125","Brunnadern","CH","Männlich","1995-02-20","Aktiv-A G50m","A","LizenzG50m",null,null,null,null,5]
["1.17.0.10.015","Brunnadern Sportschützen Neckertal","1253691","305619","Andreas","Schweizer","Strick 580","9125","Brunnadern","CH","Männlich","1993-04-23","Aktiv-A G50m","A","LizenzG50m",null,null,null,null,5]
["1.17.0.10.015","Brunnadern Sportschützen Neckertal","1728731","799454","Jonathan","Steiner","Steinenbach 882","9114","Hoffeld","CH","Männlich","2004-04-10","Aktiv-A G50m","A","LizenzG50m",null,null,null,null,5]
["1.17.0.10.015","Brunnadern Sportschützen Neckertal","1029845","6510","Timo","Ziegler","Oberer Baumgarten","9127","St. Peterzell","CH","Männlich","2010-04-07","Aktiv-A G50m","A","LizenzG50m",null,null,null,null,5]
["1.17.0.10.015","Brunnadern Sportschützen Neckertal","1467784","519721","Marco","Zogg","Oberdorfstr. 8","9100","Herisau","CH","Männlich","1995-12-06","Aktiv-A G50m","A","LizenzG50m",null,null,null,null,5]
["1.44.0.00.009","Degersheim Sportschützen","1131816","183736","Hubert","Ammann","Gibelhalde 17A","9100","Herisau","CH","Männlich","1962-06-15","Aktiv-A G50m","A","LizenzG50m",null,null,null,null,5]
["1.44.0.00.009","Degersheim Sportschützen","1411526","33099","Jan","Brugger","","9113","Degersheim","CH","Männlich","1997-11-02","Aktiv-A G50m","A","LizenzG50m",null,null,null,null,5]
["1.44.0.00.009","Degersheim Sportschützen","1257568","309496","Nadine","Bänziger","Ob der Glattmüli 2476","9100","Herisau","CH","Weiblich","1990-07-12","Aktiv-A G50m","A","LizenzG50m",null,null,null,null,5]
["1.44.0.00.009","Degersheim Sportschützen","1053650","105564","Rudolf","Büchi","Neue Steig 2A","9100","Herisau","CH","Männlich","1944-10-16","Aktiv-A G50m","A","LizenzG50m",null,null,null,null,5]
["1.44.0.00.009","Degersheim Sportschützen","1921806","33100","Lisa","Derungs","Feldeggstrasse 3","9113","Degersheim","CH","Weiblich","1999-09-24","Aktiv-A G50m","A","LizenzG50m",null,null,null,null,5]
["1.44.0.00.009","Degersheim Sportschützen","1048359","100273","Hans","Dütschler","Gleisweg 3","9104","Waldstatt","CH","Männlich","1954-10-23","Aktiv-A G50m","A","LizenzG50m",null,null,null,null,5]
["1.44.0.00.009","Degersheim Sportschützen","1061194","113109","Martin","Gyger","Kirchgasse 23","9500","Wil SG","CH","Männlich","1985-09-10","Aktiv-B G50m","B","LizenzG50m",null,null,null,null,5]
["1.44.0.00.009","Degersheim Sportschützen","1870727","950075","Alexander","Jäger","Taastr. 3","9113","Degersheim","CH","Männlich","1973-05-14","Aktiv-A G50m","A","LizenzG50m",null,null,null,null,5]
["1.44.0.00.009","Degersheim Sportschützen","1036906","13619","Sascha","Jäger","Wespiwiese 11","9244","Niederuzwil","CH","Männlich","2003-07-19","Aktiv-A G50m","A","LizenzG50m",null,null,null,null,5]
["1.44.0.00.009","Degersheim Sportschützen","2200483","3784","Florian","Kolp","Gossauerstrasse 129","9100","Herisau","CH","Männlich","2006-12-01","Aktiv-A G50m","A","LizenzG50m",null,null,null,null,5]
["1.44.0.00.009","Degersheim Sportschützen","1065597","117512","Markus","Krüsi","Rämsen 636","9063","Stein AR","CH","Männlich","1980-09-11","Aktiv-A G50m","A","LizenzG50m",null,null,null,null,5]
["1.44.0.00.009","Degersheim Sportschützen","1132142","184062","Werner","Marti","Dorfstr. 50","9104","Waldstatt","CH","Männlich","1952-12-18","Aktiv-A G50m","A","LizenzG50m",null,null,null,null,5]
["1.44.0.00.009","Degersheim Sportschützen","1061090","113005","Roland","Mettler","hintere Haldenstr. 8","9633","Bächli (Hemberg)","CH","Männlich","1955-06-09","Aktiv-A G50m","A","LizenzG50m",null,null,null,null,5]
["1.44.0.00.009","Degersheim Sportschützen","1061359","113274","Bruno","Müller","Im Grund 16a","9012","St. Gallen","CH","Männlich","1953-07-08","Aktiv-B G50m","B","LizenzG50m",null,null,null,null,5]
["1.44.0.00.009","Degersheim Sportschützen","1074730","126646","Rolf","Raschle","Austr.18","9242","Oberuzwil","CH","Männlich","1961-04-05","Aktiv-A G50m","A","LizenzG50m",null,null,null,null,5]
["1.44.0.00.009","Degersheim Sportschützen","1639637","25542","Kevin","Schiess","Schwänberg 2665","9100","Herisau","CH","Männlich","2000-07-22","Aktiv-A G50m","A","LizenzG50m",null,null,null,null,5]
["1.44.0.00.009","Degersheim Sportschützen","1061197","113112","Sonja","Siegenthaler","Feldwiesstr. 2","9621","Oberhelfenschwil","CH","Weiblich","1980-10-20","Aktiv-A G50m","A","LizenzG50m",null,null,null,null,5]
["1.44.0.00.009","Degersheim Sportschützen","1040447","17194","Svea","Siegenthaler","Feldwiesstr. 2","9621","Oberhelfenschwil","CH","Weiblich","2012-03-19","Aktiv-B G50m","B","LizenzG50m",null,null,null,null,5]
["1.44.0.00.009","Degersheim Sportschützen","1217804","269731","Hansueli","Stricker","Ob der Glattmüli 2476","9100","Herisau","CH","Männlich","1986-09-10","Aktiv-A G50m","A","LizenzG50m",null,null,null,null,5]
["1.44.0.00.009","Degersheim Sportschützen","1523794","3780","Adrian","von Allmen","Talholz 675","9113","Degersheim","CH","Männlich","2004-07-14","Aktiv-A G50m","A","LizenzG50m",null,null,null,null,5]
["1.44.0.00.022","Kirchberg Sportschützen","1220297","272224","Thomas","Berger","Hauptstrasse 76","9553","Bettwiesen","CH","Männlich","1992-04-17","Aktiv-A G50m","A","LizenzG50m",null,null,null,null,5]
["1.44.0.00.022","Kirchberg Sportschützen","1803990","879931","Kevin","Bernet","","9533","Kirchberg","CH","Männlich","2005-05-10","Aktiv-A G50m","A","LizenzG50m",null,null,null,null,5]
["1.44.0.00.022","Kirchberg Sportschützen","2208627","5703","Tobias","Feldmeyer","St. Otmarstrasse 22","9204","Andwil SG","CH","Männlich","2004-02-06","Aktiv-A G50m","A","LizenzG50m",null,null,null,null,5]
["1.44.0.00.022","Kirchberg Sportschützen","1061219","113134","Hans","Forster","Im Bitzi 26","9523","Züberwangen","CH","Männlich","1956-06-20","Aktiv-A G50m","A","LizenzG50m",null,null,null,null,5]
["1.44.0.00.022","Kirchberg Sportschützen","1719184","788942","Janis","Früh","Mitteldorfstrasse 13","9533","Kirchberg SG","CH","Männlich","2004-02-13","Aktiv-A G50m","A","LizenzG50m",null,null,null,null,5]
["1.44.0.00.022","Kirchberg Sportschützen","1239248","291175","Hansruedi","Fässler","Trubeweg 1","9533","Dietschwil","CH","Männlich","1971-04-01","Aktiv-A G50m","A","LizenzG50m",null,null,null,null,5]
["1.44.0.00.022","Kirchberg Sportschützen","1061097","113012","Felix","Fässler","Gehrenstr. 28","9556","Affeltrangen","CH","Männlich","1975-11-19","Aktiv-A G50m","A","LizenzG50m",null,null,null,null,5]
["1.44.0.00.022","Kirchberg Sportschützen","1061098","113013","Roland","Graf","Schmiedgasse 6","3150","Schwarzenburg","CH","Männlich","1968-11-21","Aktiv-B G50m","B","LizenzG50m",null,null,null,null,5]
["1.44.0.00.022","Kirchberg Sportschützen","2276638","45427","Carmen","Gubelmann","Hirzlistrasse 9","8732","Neuhaus SG","CH","Weiblich","2005-08-19","Aktiv-A G50m","A","LizenzG50m",null,null,null,null,5]
["1.44.0.00.022","Kirchberg Sportschützen","2364465","45344","Toni","Haltiner","Panoramastrasse 14a","9533","Kirchberg SG","CH","Männlich","2003-12-26","Aktiv-A G50m","A","LizenzG50m",null,null,null,null,5]
["1.44.0.00.022","Kirchberg Sportschützen","1204349","256275","Patrick","Hauptmann","Hänisberg","9602","Müselbach","CH","Männlich","1988-05-20","Aktiv-A G50m","A","LizenzG50m",null,null,null,null,5]
["1.44.0.00.022","Kirchberg Sportschützen","1060742","112657","Jens","Hauptmann","Hänisberg 3984","9602","Müselbach","CH","Männlich","1960-07-11","Aktiv-A G50m","A","LizenzG50m",null,null,null,null,5]
["1.44.0.00.022","Kirchberg Sportschützen","1173651","225576","Werner","Keller","Hauptstr. 23","8376","Fischingen","CH","Männlich","1962-06-08","Aktiv-A G50m","A","LizenzG50m",null,null,null,null,5]
["1.44.0.00.022","Kirchberg Sportschützen","1266126","318056","Beda","Klaus","Hofackerweg 2","8376","Fischingen","CH","Männlich","1953-01-17","Aktiv-A G50m","A","LizenzG50m",null,null,null,null,5]
["1.44.0.00.022","Kirchberg Sportschützen","1240045","291972","David","Klaus","Oberdorfstrasse 13a","9512","Rossrüti","CH","Männlich","1992-03-26","Aktiv-A G50m","A","LizenzG50m",null,null,null,null,5]
["1.44.0.00.022","Kirchberg Sportschützen","1061223","113138","Andreas","Lenherr","Lehwies Weg 1","9608","Ganterschwil","CH","Männlich","1952-11-24","Aktiv-A G50m","A","LizenzG50m",null,null,null,null,5]
["1.44.0.00.022","Kirchberg Sportschützen","1061102","113017","Paul","Mäder","Boolwisstr. 20","9533","Dietschwil","CH","Männlich","1956-11-17","Aktiv-A G50m","A","LizenzG50m",null,null,null,null,5]
["1.44.0.00.022","Kirchberg Sportschützen","1035845","12551","Ciril","Rohner","Rebbergstr. 9","9500","Wil","CH","Männlich","2006-03-11","Aktiv-A G50m","A","LizenzG50m",null,null,null,null,5]
["1.44.0.00.022","Kirchberg Sportschützen","2261999","20520","Noah","Ruch","","8360","Eschlikon","","Männlich","2005-07-26","Aktiv-A G50m","A","LizenzG50m",null,null,null,null,5]
["1.44.0.00.022","Kirchberg Sportschützen","1803992","879933","Stephanie","Scherrer","unt. Harfenbergstr. 5","9533","Kirchberg SG","CH","Weiblich","2004-07-20","Aktiv-A G50m","A","LizenzG50m",null,null,null,null,5]
["1.44.0.00.022","Kirchberg Sportschützen","1698043","766199","Mario","Schlau","Unterdorfstrasse 9","9524","Zuzwil SG","CH","Männlich","1989-03-21","Aktiv-A G50m","A","LizenzG50m",null,null,null,null,5]
["1.44.0.00.028","Mosnang Sportschützen","1060854","112769","René","Bamert","Weidlistr. 51","9607","Mosnang","CH","Männlich","1972-04-01","Aktiv-A G50m","A","LizenzG50m",null,null,null,null,5]
["1.44.0.00.028","Mosnang Sportschützen","1150115","202038","Josef","Baumann","Ritzentaa 2195","9615","Diefurt","CH","Männlich","1969-04-16","Aktiv-A G50m","A","LizenzG50m",null,null,null,null,5]
["1.44.0.00.028","Mosnang Sportschützen","1061190","113105","Heinrich","Bleiker","am Oelberg 14","9500","Wil SG","CH","Männlich","1952-03-20","Aktiv-A G50m","A","LizenzG50m",null,null,null,null,5]
["1.44.0.00.028","Mosnang Sportschützen","1061435","113350","Werner","Bleiker","Schomattenstr. 44","9630","Wattwil","CH","Männlich","1959-01-11","Aktiv-A G50m","A","LizenzG50m",null,null,null,null,5]
["1.44.0.00.028","Mosnang Sportschützen","1030767","7438","Gaby","Bär","Hembergerstr. 50","9630","Wattwil","CH","Weiblich","1980-05-27","Aktiv-A G50m","A","LizenzG50m",null,null,null,null,5]
["1.44.0.00.028","Mosnang Sportschützen","1060960","112875","Marcel","Bürge","Püntacherstrasse 8","8487","Zell ZH","CH","Männlich","1972-03-28","Aktiv-B G50m","B","LizenzG50m",null,null,null,null,5]
["1.44.0.00.028","Mosnang Sportschützen","1061192","113107","Rolf","Egli","Schulstr. 21","8543","Gundetswil","CH","Männlich","1956-05-13","Aktiv-A G50m","A","LizenzG50m",null,null,null,null,5]
["1.44.0.00.028","Mosnang Sportschützen","1061439","113354","Beat","Eugster","Oberdorfstrasse 7","9243","Jonschwil","CH","Männlich","1966-04-23","Aktiv-A G50m","A","LizenzG50m",null,null,null,null,5]
["1.44.0.00.028","Mosnang Sportschützen","1061442","113357","Kurt","Hug","Stadtaustr. 18","9620","Lichtensteig","CH","Männlich","1949-01-06","Aktiv-A G50m","A","LizenzG50m",null,null,null,null,5]
["1.44.0.00.028","Mosnang Sportschützen","1061199","113114","Albin","Meier","Obere Rittbergstr. 2","9615","Dietfurt","CH","Männlich","1957-08-31","Aktiv-A G50m","A","LizenzG50m",null,null,null,null,5]
["1.44.0.00.028","Mosnang Sportschützen","1060880","112795","Philipp","Metzger","Hauptstr. 11","9650","Nesslau","CH","Männlich","1977-03-28","Aktiv-A G50m","A","LizenzG50m",null,null,null,null,5]
["1.44.0.00.028","Mosnang Sportschützen","1061202","113117","Josef","Mullis","Lindenplatz 1","9607","Mosnang","CH","Männlich","1950-02-28","Aktiv-A G50m","A","LizenzG50m",null,null,null,null,5]
["1.44.0.00.028","Mosnang Sportschützen","1038482","15212","Nils","Truniger","Sonnhalden 52","9607","Mosnang","CH","Männlich","2008-02-29","Aktiv-A G50m","A","LizenzG50m",null,null,null,null,5]
["1.44.0.00.028","Mosnang Sportschützen","1060888","112803","André","Waser","Schomattenstr. 49","9630","Wattwil","CH","Männlich","1963-01-02","Aktiv-A G50m","A","LizenzG50m",null,null,null,null,5]
["1.44.0.00.028","Mosnang Sportschützen","1060889","112804","Hanspeter","Widmer","Bechten 1086","9613","Mühlrüti","CH","Männlich","1973-03-17","Aktiv-A G50m","A","LizenzG50m",null,null,null,null,5]
["1.44.0.00.055","Dicken Ebnat-Kappel Sportschützen","1078342","130258","Brigitte","Baumann","Dorf 929","9651","Ennetbühl","CH","Weiblich","1978-10-24","Aktiv-A G50m","A","LizenzG50m",null,null,null,null,5]
["1.44.0.00.055","Dicken Ebnat-Kappel Sportschützen","1060856","112771","Daniel","Brägger","Trempelbrücke 3","9643","Krummenau","CH","Männlich","1972-03-28","Aktiv-A G50m","A","LizenzG50m",null,null,null,null,5]
["1.44.0.00.055","Dicken Ebnat-Kappel Sportschützen","1061567","113482","Heini","Bösch","Ebnaterstr. 6","9642","Ebnat-Kappel","CH","Männlich","1936-11-25","Aktiv-A G50m","A","LizenzG50m",null,null,null,null,5]
["1.44.0.00.055","Dicken Ebnat-Kappel Sportschützen","1851690","930061","Roman","Geisser","Kapplerstr. 25","9642","Ebnat-Kappel","CH","Männlich","2006-12-17","Aktiv-A G50m","A","LizenzG50m",null,null,null,null,5]
["1.44.0.00.055","Dicken Ebnat-Kappel Sportschützen","2306609","34139","Leo","Güttinger","Bühl 2288","9650","Nesslau","CH","Männlich","2011-01-13","Aktiv-A G50m","A","LizenzG50m",null,null,null,null,5]
["1.44.0.00.055","Dicken Ebnat-Kappel Sportschützen","1060861","112776","Martin","Hartmann","Stegweidstr. 4","8496","Steg","CH","Männlich","1972-11-24","Aktiv-A G50m","A","LizenzG50m",null,null,null,null,5]
["1.44.0.00.055","Dicken Ebnat-Kappel Sportschützen","1060865","112780","Roman","Hollenstein","Berglistr. 34","9642","Ebnat-Kappel","CH","Männlich","1958-09-13","Aktiv-A G50m","A","LizenzG50m",null,null,null,null,5]
["1.44.0.00.055","Dicken Ebnat-Kappel Sportschützen","1060867","112782","Iwan","Hüppi","Felsensteinstr. 16","9642","Ebnat-Kappel","CH","Männlich","1980-10-05","Aktiv-A G50m","A","LizenzG50m",null,null,null,null,5]
["1.44.0.00.055","Dicken Ebnat-Kappel Sportschützen","1060866","112781","Erhard","Hüppi","Steinenbachstr. 22","9642","Ebnat-Kappel","CH","Männlich","1954-06-18","Aktiv-A G50m","A","LizenzG50m",null,null,null,null,5]
["1.44.0.00.055","Dicken Ebnat-Kappel Sportschützen","1030213","6882","Lena","Jordi","Howartstr. 33","9642","Ebnat-Kappel","CH","Weiblich","2010-09-21","Aktiv-A G50m","A","LizenzG50m",null,null,null,null,5]
["1.44.0.00.055","Dicken Ebnat-Kappel Sportschützen","1477535","529472","Martina","Kaiser","Wiedenstrasse 40","9470","Buchs SG","CH","Weiblich","1996-03-15","Aktiv-B G50m","B","LizenzG50m",null,null,null,null,5]
["1.44.0.00.055","Dicken Ebnat-Kappel Sportschützen","1060871","112786","Markus","Künzli","Howartstr. 22","9642","Ebnat-Kappel","CH","Männlich","1974-05-10","Aktiv-A G50m","A","LizenzG50m",null,null,null,null,5]
["1.44.0.00.055","Dicken Ebnat-Kappel Sportschützen","1855969","934456","Ian","Künzli","Howartstr. 22","9642","Ebnat-Kappel","CH","Männlich","2006-07-15","Aktiv-A G50m","A","LizenzG50m",null,null,null,null,5]
["1.44.0.00.055","Dicken Ebnat-Kappel Sportschützen","1060870","112785","Hanspeter","Künzli","Howartstr. 33","9642","Ebnat-Kappel","CH","Männlich","1967-04-06","Aktiv-A G50m","A","LizenzG50m",null,null,null,null,5]
["1.44.0.00.055","Dicken Ebnat-Kappel Sportschützen","1061572","113487","Werner","Leuzinger","Gillstrasse 10","9642","Ebnat-Kappel","CH","Männlich","1943-01-17","Aktiv-A G50m","A","LizenzG50m",null,null,null,null,5]
["1.44.0.00.055","Dicken Ebnat-Kappel Sportschützen","1060878","112793","Hansueli","Mettler","Gerbeweg 15","9630","Wattwil","CH","Männlich","1965-12-12","Aktiv-A G50m","A","LizenzG50m",null,null,null,null,5]
["1.44.0.00.055","Dicken Ebnat-Kappel Sportschützen","1060879","112794","Reto","Mettler","Mühlebergstr. 1","8450","Andelfingen","CH","Männlich","1975-05-10","Aktiv-A G50m","A","LizenzG50m",null,null,null,null,5]
["1.44.0.00.055","Dicken Ebnat-Kappel Sportschützen","1060883","112798","Franco","Santoro","Schrennenstr. 9","8733","Eschenbach SG","CH","Männlich","1971-01-18","Aktiv-A G50m","A","LizenzG50m",null,null,null,null,5]
["1.44.0.00.055","Dicken Ebnat-Kappel Sportschützen","1244107","296034","Martina","Scherrer","Schneitstr. 6","9650","Nesslau","CH","Weiblich","1994-05-21","Aktiv-A G50m","A","LizenzG50m",null,null,null,null,5]
["1.44.0.00.055","Dicken Ebnat-Kappel Sportschützen","1234670","286597","Karin","Scherrer","Bürerfeld 16A","9245","Oberbüren","CH","Weiblich","1992-02-29","Aktiv-A G50m","A","LizenzG50m",null,null,null,null,5]
["1.44.0.00.055","Dicken Ebnat-Kappel Sportschützen","1060884","112799","Hans","Scherrer","Berglistr. 54","9642","Ebnat-Kappel","CH","Männlich","1954-05-22","Aktiv-A G50m","A","LizenzG50m",null,null,null,null,5]
["1.44.0.00.055","Dicken Ebnat-Kappel Sportschützen","1060868","112783","Marlen","Schilliger","Städeliweg 5","9220","Bischofszell","CH","Weiblich","1983-10-02","Aktiv-A G50m","A","LizenzG50m",null,null,null,null,5]
["1.44.0.00.055","Dicken Ebnat-Kappel Sportschützen","1060774","112689","Marcel","Schilliger","Städeliweg 5","9220","Bischofszell","CH","Männlich","1981-06-26","Aktiv-A G50m","A","LizenzG50m",null,null,null,null,5]
["1.44.0.00.055","Dicken Ebnat-Kappel Sportschützen","1094005","145922","Heiri","Tschumper","Büel 517","9630","Wattwil","CH","Männlich","1981-02-04","Aktiv-A G50m","A","LizenzG50m",null,null,null,null,5]
["1.44.0.00.055","Dicken Ebnat-Kappel Sportschützen","1206551","258477","Remo","Wild","Thuraustr. 44","9642","Ebnat-Kappel","CH","Männlich","1976-06-15","Aktiv-A G50m","A","LizenzG50m",null,null,null,null,5]
["1.44.0.00.055","Dicken Ebnat-Kappel Sportschützen","1061577","113492","Michael","Wymann","Ebnaterstr. 39","9642","Ebnat-Kappel","CH","Männlich","1979-03-25","Aktiv-A G50m","A","LizenzG50m",null,null,null,null,5]
["1.44.0.00.055","Dicken Ebnat-Kappel Sportschützen","1065356","117271","Sonja","van Winden","Sidwaldstrasse 22","9652","Neu St. Johann","CH","Weiblich","1971-11-04","Aktiv-A G50m","A","LizenzG50m",null,null,null,null,5]
["1.17.0.01.170","Gossau SG Sportschützen","1814671","891331","Yanik","Adrian","Büelwiesstrasse 3","9200","Gossau SG","CH","Männlich","2008-12-09","Aktiv-A G50m","A","LizenzG50m",null,null,null,null,6]
["1.17.0.01.170","Gossau SG Sportschützen","1042963","19721","Ronja","Adrian","Büelwiesstrasse 3","9200","Gossau SG","CH","Weiblich","2011-05-24","Aktiv-A G50m","A","LizenzG50m",null,null,null,null,6]
["1.17.0.01.170","Gossau SG Sportschützen","1086734","138651","Doris","Alther","Sonnentalstr. 9","9036","Grub SG","CH","Weiblich","1967-02-25","Aktiv-A G50m","A","LizenzG50m",null,null,null,null,6]
["1.17.0.01.170","Gossau SG Sportschützen","1272923","324853","Lars","Baumann","Winkelstr. 14","9100","Herisau","CH","Männlich","1997-12-30","Aktiv-A G50m","A","LizenzG50m",null,null,null,null,6]
["1.17.0.01.170","Gossau SG Sportschützen","2301060","33495","Ron","Binder","Abt Bedastrasse 3","9245","Sonnental","CH","Männlich","2014-05-22","Aktiv-A G50m","A","LizenzG50m",null,null,null,null,6]
["1.17.0.01.170","Gossau SG Sportschützen","2220583","9690","Jonas","Bohnenblust","Herisauerstrasse 63a","9015","St. Gallen","CH","Männlich","2009-07-09","Aktiv-A G50m","A","LizenzG50m",null,null,null,null,6]
["1.17.0.01.170","Gossau SG Sportschützen","1905941","986769","Aline Sophia","Brunner","Witenwisstr. 8","9200","Gossau SG","CH","Weiblich","2010-11-29","Aktiv-A G50m","A","LizenzG50m",null,null,null,null,6]
["1.17.0.01.170","Gossau SG Sportschützen","1239879","291806","Joel","Brüschweiler","Hochwachtstr. 28","6312","Steinhausen","CH","Männlich","1993-06-19","Aktiv-A G50m","A","LizenzG50m",null,null,null,null,6]
["1.17.0.01.170","Gossau SG Sportschützen","1683593","750766","Janis","Buob","Entenmoos 2","8561","Ottoberg","CH","Männlich","2001-10-05","Aktiv-A G50m","A","LizenzG50m",null,null,null,null,6]
["1.17.0.01.170","Gossau SG Sportschützen","1884233","964250","Fabian","Böniger","Haggenhaldenstr. 41a","9014","St. Gallen 14 Bruggen","CH","Männlich","2001-12-20","Aktiv-A G50m","A","LizenzG50m",null,null,null,null,6]
["1.17.0.01.170","Gossau SG Sportschützen","1235489","287416","René","Bürge","Böhlisjockes 10","9057","Weissbad","CH","Männlich","1968-09-15","Aktiv-A G50m","A","LizenzG50m",null,null,null,null,6]
["1.17.0.01.170","Gossau SG Sportschützen","1060960","112875","Marcel","Bürge","Püntacherstrasse 8","8487","Zell ZH","CH","Männlich","1972-03-28","Aktiv-A G50m","A","LizenzG50m",null,null,null,null,6]
["1.17.0.01.170","Gossau SG Sportschützen","1705200","773682","Christian","Dänzer","Bischofszellerstr. 24b","9200","Gossau SG","CH","Männlich","2006-12-19","Aktiv-A G50m","A","LizenzG50m",null,null,null,null,6]
["1.17.0.01.170","Gossau SG Sportschützen","1258976","310904","Christoph","Dürr","Hueb 13","9473","Gams","CH","Männlich","1996-04-28","Aktiv-A G50m","A","LizenzG50m",null,null,null,null,6]
["1.17.0.01.170","Gossau SG Sportschützen","1273884","325814","Ladina","Feuz","Erlenstrasse 14","8753","Mollis","CH","Weiblich","1996-05-11","Aktiv-A G50m","A","LizenzG50m",null,null,null,null,6]
["1.17.0.01.170","Gossau SG Sportschützen","1738804","810047","Anouk","Fässler","Höhenweg 31","9642","Ebnat-Kappel","CH","Weiblich","2006-02-04","Aktiv-A G50m","A","LizenzG50m",null,null,null,null,6]
["1.17.0.01.170","Gossau SG Sportschützen","1257035","308963","Sandro","Greuter","Im Stoffel 15","8887","Mels","CH","Männlich","1993-02-25","Aktiv-B G50m","B","LizenzG50m",null,null,null,null,6]
["1.17.0.01.170","Gossau SG Sportschützen","2325133","41076","Damian","Halter","Büelstrasse 32","9200","Gossau SG","CH","Männlich","2012-11-05","Aktiv-A G50m","A","LizenzG50m",null,null,null,null,6]
["1.17.0.01.170","Gossau SG Sportschützen","1856780","935296","Selina","Hoenes","Birkenhainweg 5","8840","Einsiedeln","CH","Weiblich","2006-07-08","Aktiv-B G50m","B","LizenzG50m",null,null,null,null,6]
["1.17.0.01.170","Gossau SG Sportschützen","1270824","28268","Marco","Linder","Turbenthalstrasse 2","8363","Bichelsee","CH","Männlich","1995-07-30","Aktiv-A G50m","A","LizenzG50m",null,null,null,null,6]
["1.17.0.01.170","Gossau SG Sportschützen","1026140","2747","Gina","Pelladoni","Seestrasse 118","8267","Berlingen","CH","Weiblich","2006-09-12","Aktiv-A G50m","A","LizenzG50m",null,null,null,null,6]
["1.17.0.01.170","Gossau SG Sportschützen","1716294","785724","Simon","Pironato","Gehrenstrasse 17","9230","Flawil","CH","Männlich","2002-03-28","Aktiv-A G50m","A","LizenzG50m",null,null,null,null,6]
["1.17.0.01.170","Gossau SG Sportschützen","1044847","21613","Ben","Rechsteiner","Dorfstrasse 9","9204","Andwil SG","CH","Männlich","2012-08-08","Aktiv-A G50m","A","LizenzG50m",null,null,null,null,6]
["1.17.0.01.170","Gossau SG Sportschützen","1039929","16672","Noah","Rhyner","Folenweg 2","9230","Flawil","CH","Männlich","2014-08-01","Aktiv-A G50m","A","LizenzG50m",null,null,null,null,6]
["1.17.0.01.170","Gossau SG Sportschützen","1464090","516027","Franziska Rebecca","Stark","Hohlstr. 482","8048","Zürich","CH","Weiblich","1999-02-18","Aktiv-A G50m","A","LizenzG50m",null,null,null,null,6]
["1.17.0.01.170","Gossau SG Sportschützen","1844229","922270","Kaya","Staub","Oberdörfli 10B","9215","Schönenberg TG","CH","Weiblich","2008-06-14","Aktiv-A G50m","A","LizenzG50m",null,null,null,null,6]
["1.17.0.01.170","Gossau SG Sportschützen","2217936","8236","Mila","Steudler","Nelkenstrasse 12","9113","Degersheim","CH","Weiblich","2014-01-02","Aktiv-A G50m","A","LizenzG50m",null,null,null,null,6]
["1.17.0.01.170","Gossau SG Sportschützen","1062108","114023","Christoph","Strässle","Fahrnstr. 38","9402","Mörschwil","CH","Männlich","1983-08-10","Aktiv-A G50m","A","LizenzG50m",null,null,null,null,6]
["1.17.0.01.170","Gossau SG Sportschützen","1890656","970877","Alexia","Tela","Via Strada Regina 23","6832","Pedrinate","CH","Weiblich","2006-02-15","Aktiv-A G50m","A","LizenzG50m",null,null,null,null,6]
["1.17.0.01.170","Gossau SG Sportschützen","1405782","457718","Elena","Tomaschett","Via Fravia 24","7172","Rabius","CH","Weiblich","1996-01-15","Aktiv-A G50m","A","LizenzG50m",null,null,null,null,6]
["1.17.0.01.170","Gossau SG Sportschützen","1621137","683814","Sascha","Weber","Seeblickstr. 26","9327","Tübach","CH","Männlich","1983-06-03","Aktiv-A G50m","A","LizenzG50m",null,null,null,null,6]
["1.17.0.01.170","Gossau SG Sportschützen","1039375","16116","Kilian","Zahner","Lehstr. 5","9245","Sonnental","CH","Männlich","2013-06-14","Aktiv-A G50m","A","LizenzG50m",null,null,null,null,6]
["1.17.0.01.170","Gossau SG Sportschützen","1539198","599484","Remo","Zuberbühler","Lehnen 555","9107","Urnäsch","CH","Männlich","2002-03-13","Aktiv-A G50m","A","LizenzG50m",null,null,null,null,6]
["1.20.0.01.014","Arbon-Roggwil, Tälischützen","1715263","784629","Simon","Athanasiadis","Erchenwilerstrasse 7 d","9306","Freidorf","CH","Männlich","2002-02-12","Aktiv-A G50m","A","LizenzG50m",null,null,null,null,6]
["1.20.0.01.014","Arbon-Roggwil, Tälischützen","1060707","112622","Adrian","Bischofberger","Dorfstr. 40","9305","Berg","CH","Männlich","1972-09-10","Aktiv-A G50m","A","LizenzG50m",null,null,null,null,6]
["1.20.0.01.014","Arbon-Roggwil, Tälischützen","1125690","177610","Stefan","Brühlmann","Rosengarten 1","9315","Winden","CH","Männlich","1981-03-30","Aktiv-A G50m","A","LizenzG50m",null,null,null,null,6]
["1.20.0.01.014","Arbon-Roggwil, Tälischützen","1695856","763911","Domenic","Burger","Ulmenstrasse 9","9000","St. Gallen","CH","Männlich","1999-09-19","Aktiv-A G50m","A","LizenzG50m",null,null,null,null,6]
["1.20.0.01.014","Arbon-Roggwil, Tälischützen","1224772","276699","Christian","Grob","Grüntalstr. 19","9320","Arbon","CH","Männlich","1965-05-12","Aktiv-A G50m","A","LizenzG50m",null,null,null,null,6]
["1.20.0.01.014","Arbon-Roggwil, Tälischützen","1695857","763912","Roger","Gächter","Aachweg 8","9323","Steinach","CH","Männlich","2001-05-10","Aktiv-A G50m","A","LizenzG50m",null,null,null,null,6]
["1.20.0.01.014","Arbon-Roggwil, Tälischützen","1715269","784635","Fabian","Gächter","Aachweg 8","9323","Steinach","CH","Männlich","2002-10-08","Aktiv-A G50m","A","LizenzG50m",null,null,null,null,6]
["1.20.0.01.014","Arbon-Roggwil, Tälischützen","1060712","112627","Ivo","Günther","Birmensdorferstr. 140","8003","Zürich","CH","Männlich","1988-10-31","Aktiv-A G50m","A","LizenzG50m",null,null,null,null,6]
["1.20.0.01.014","Arbon-Roggwil, Tälischützen","1033657","10346","Leonie","Klingler","Fallentürliweg 23","9320","Arbon","CH","Weiblich","2007-07-11","Aktiv-A G50m","A","LizenzG50m",null,null,null,null,6]
["1.20.0.01.014","Arbon-Roggwil, Tälischützen","1033654","10343","Silas","Müller","Mattenhof 461","9323","Steinach","CH","Männlich","2009-08-15","Aktiv-A G50m","A","LizenzG50m",null,null,null,null,6]
["1.20.0.01.014","Arbon-Roggwil, Tälischützen","1795357","870763","Nicolas","Rutz","Arbonerstr. 12","9315","Neukirch (Egnach)","CH","Männlich","2001-01-31","Aktiv-A G50m","A","LizenzG50m",null,null,null,null,6]
["1.20.0.01.014","Arbon-Roggwil, Tälischützen","1241129","293056","Pascal","Schroeter","Fischergasse 4","9320","Arbon","CH","Männlich","1936-08-05","Aktiv-A G50m","A","LizenzG50m",null,null,null,null,6]
["1.20.0.01.014","Arbon-Roggwil, Tälischützen","1618435","681004","Elias","Schällebaum","Haldenweg 11","9306","Freidorf TG","CH","Männlich","2001-06-13","Aktiv-A G50m","A","LizenzG50m",null,null,null,null,6]
["1.20.0.01.014","Arbon-Roggwil, Tälischützen","1125579","177499","Emil","Schällebaum","Haldenweg 11","9306","Freidorf TG","CH","Männlich","1966-10-22","Aktiv-A G50m","A","LizenzG50m",null,null,null,null,6]
["1.44.0.00.007","Bischofszell Sportschützen","1032180","8863","Rita","Burch","Obere Rebrainstr. 19","9213","Hauptwil","CH","Weiblich","1952-03-02","Aktiv-A G50m","A","LizenzG50m",null,null,null,null,6]
["1.44.0.00.007","Bischofszell Sportschützen","1060755","112670","Blasius","Burch","Ob. Rebrainstr. 19","9213","Hauptwil","CH","Männlich","1948-01-19","Aktiv-A G50m","A","LizenzG50m",null,null,null,null,6]
["1.44.0.00.007","Bischofszell Sportschützen","1060760","112675","Roman","Frei","Hintere Büelstr. 17a","9246","Niederbüren","CH","Männlich","1979-01-30","Aktiv-A G50m","A","LizenzG50m",null,null,null,null,6]
["1.44.0.00.007","Bischofszell Sportschützen","1060758","112673","Hans","Frei","Hauptstr. 9","8580","Sommeri","CH","Männlich","1946-02-04","Aktiv-A G50m","A","LizenzG50m",null,null,null,null,6]
["1.44.0.00.007","Bischofszell Sportschützen","1056243","108158","Roman","Frei","Romanshornerstr. 28","8592","Uttwil","CH","Männlich","1961-09-28","Aktiv-B G50m","B","LizenzG50m",null,null,null,null,6]
["1.44.0.00.007","Bischofszell Sportschützen","1061500","113415","René","Fritsche","Schachenstr. 19","9243","Jonschwil","CH","Männlich","1962-09-23","Aktiv-A G50m","A","LizenzG50m",null,null,null,null,6]
["1.44.0.00.007","Bischofszell Sportschützen","1060763","112678","Werner","Hänggi","Städelistr. 7","9220","Bischofszell","CH","Männlich","1947-08-10","Aktiv-A G50m","A","LizenzG50m",null,null,null,null,6]
["1.44.0.00.007","Bischofszell Sportschützen","1060767","112682","Daniel","Kägi","Espenstr. 24","9220","Bischofszell","CH","Männlich","1974-12-26","Aktiv-A G50m","A","LizenzG50m",null,null,null,null,6]
["1.44.0.00.007","Bischofszell Sportschützen","1060768","112683","Daniel","Leibundgut","Bürglistr. 12","9000","St. Gallen","CH","Männlich","1971-03-28","Aktiv-A G50m","A","LizenzG50m",null,null,null,null,6]
["1.44.0.00.007","Bischofszell Sportschützen","1060774","112689","Marcel","Schilliger","Städeliweg 5","9220","Bischofszell","CH","Männlich","1981-06-26","Aktiv-B G50m","B","LizenzG50m",null,null,null,null,6]
["1.44.0.00.007","Bischofszell Sportschützen","1060868","112783","Marlen","Schilliger","Städeliweg 5","9220","Bischofszell","CH","Weiblich","1983-10-02","Aktiv-B G50m","B","LizenzG50m",null,null,null,null,6]
["1.44.0.00.007","Bischofszell Sportschützen","1226295","278222","Patrick","Zihlmann","Obere Hagenwilerstr. 5","8588","Zihlschlacht","CH","Männlich","1987-04-09","Aktiv-B G50m","B","LizenzG50m",null,null,null,null,6]
["1.44.0.00.007","Bischofszell Sportschützen","1060780","112695","Urs","Zihlmann","Rümlangerstr. 14","8105","Watt","CH","Männlich","1955-01-17","Aktiv-B G50m","B","LizenzG50m",null,null,null,null,6]
["1.44.0.00.012","Egnach Sportschützen","1696079","764142","Sven","Beyer","Kirchweg 7","8586","Kümmertshausen","CH","Männlich","1995-04-11","Aktiv-A G50m","A","LizenzG50m",null,null,null,null,6]
["1.44.0.00.012","Egnach Sportschützen","1545433","606102","Joel","Erzinger","Bruggli 415","9063","Stein","CH","Männlich","1995-02-18","Aktiv-A G50m","A","LizenzG50m",null,null,null,null,6]
["1.44.0.00.012","Egnach Sportschützen","1060898","112813","Barbara","Infanger","Riethüslistr. 3","9012","St. Gallen","CH","Weiblich","1957-04-27","Aktiv-A G50m","A","LizenzG50m",null,null,null,null,6]
["1.44.0.00.012","Egnach Sportschützen","1060901","112816","Hans-Jürgen","Lebherz","Wilenstr. 5","9322","Egnach","CH","Männlich","1949-07-15","Aktiv-A G50m","A","LizenzG50m",null,null,null,null,6]
["1.44.0.00.012","Egnach Sportschützen","1251930","303858","Michael","Mendler","St.Gallerstr. 124","9032","Engelburg","CH","Männlich","1986-12-31","Aktiv-A G50m","A","LizenzG50m",null,null,null,null,6]
["1.44.0.00.012","Egnach Sportschützen","1060908","112823","Hans","Steiner","Amriswilerstr. 36","9314","Steinebrunn","CH","Männlich","1952-06-17","Aktiv-A G50m","A","LizenzG50m",null,null,null,null,6]
["1.44.0.00.012","Egnach Sportschützen","1192710","244636","Emil","Straub","Wiesenring 15","8590","Romanshorn","CH","Männlich","1948-02-29","Aktiv-A G50m","A","LizenzG50m",null,null,null,null,6]
["1.44.0.00.012","Egnach Sportschützen","1142124","194045","Anton","Zihlmann","Kelhofstr. 30","8599","Salmsach","CH","Männlich","1962-07-21","Aktiv-A G50m","A","LizenzG50m",null,null,null,null,6]
["1.44.0.00.019","Hatswil Sportschützen","1859645","938405","Rudolf","Benz","Martina-Hälg-Str. 19","8590","Romanshorn","CH","Männlich","1952-10-11","Aktiv-A G50m","A","LizenzG50m",null,null,null,null,6]
["1.44.0.00.019","Hatswil Sportschützen","1056243","108158","Roman","Frei","Romanshornerstr. 28","8592","Uttwil","CH","Männlich","1961-09-28","Aktiv-A G50m","A","LizenzG50m",null,null,null,null,6]
["1.44.0.00.019","Hatswil Sportschützen","1860133","938932","Susi","Jäggi","Hungerbühl 28","8599","Salmsach","CH","Weiblich","1969-04-15","Aktiv-A G50m","A","LizenzG50m",null,null,null,null,6]
["1.44.0.00.019","Hatswil Sportschützen","1056260","108175","Jürg","Koller","Stoffelsweingarten 2","8592","Uttwil","CH","Männlich","1945-05-03","Aktiv-A G50m","A","LizenzG50m",null,null,null,null,6]
["1.44.0.00.019","Hatswil Sportschützen","1065159","117074","Christian","Marolf","Lothalde 25","8595","Altnau","CH","Männlich","1989-04-11","Aktiv-A G50m","A","LizenzG50m",null,null,null,null,6]
["1.44.0.00.019","Hatswil Sportschützen","1061046","112961","Rolf","Meyer","Kesswilerstr. 11","8582","Dozwil","CH","Männlich","1968-12-21","Aktiv-A G50m","A","LizenzG50m",null,null,null,null,6]
["1.44.0.00.019","Hatswil Sportschützen","1086509","138426","Robert","Muralt","Maria-Stader-Weg 7","8590","Romanshorn","CH","Männlich","1955-05-06","Aktiv-A G50m","A","LizenzG50m",null,null,null,null,6]
["1.44.0.00.019","Hatswil Sportschützen","1205091","257017","René","Scherrer","Sonnental 4","9313","Muolen","CH","Männlich","1958-01-20","Aktiv-A G50m","A","LizenzG50m",null,null,null,null,6]
["1.44.0.00.019","Hatswil Sportschützen","1480705","532642","Martin","Schmid","Romanshornerstr. 221","8580","Hefenhofen","CH","Männlich","1955-03-13","Aktiv-A G50m","A","LizenzG50m",null,null,null,null,6]
["1.44.0.00.019","Hatswil Sportschützen","1061047","112962","Heinz","Schmidhauser","Sonnmattstr. 5B","8590","Romanshorn","CH","Männlich","1949-03-25","Aktiv-A G50m","A","LizenzG50m",null,null,null,null,6]
["1.44.0.00.019","Hatswil Sportschützen","1060777","112692","Christian","Stäheli","Büntwisenstr. 11","9205","Waldkirch","CH","Männlich","1968-08-19","Aktiv-A G50m","A","LizenzG50m",null,null,null,null,6]
["1.44.0.00.019","Hatswil Sportschützen","1174615","226540","Fredy","Villiger","Hungerbühl  28","8599","Salmsach","CH","Männlich","1964-06-06","Aktiv-A G50m","A","LizenzG50m",null,null,null,null,6]
["1.44.0.00.019","Hatswil Sportschützen","1050504","102418","Josef","Vollenweider","Hamisfeld 19","8580","Hefenhofen","CH","Männlich","1955-07-30","Aktiv-A G50m","A","LizenzG50m",null,null,null,null,6]
["1.44.0.00.019","Hatswil Sportschützen","1061050","112965","Paul","Waelti","Weiherstr. 61","8580","Amriswil","CH","Männlich","1951-11-19","Aktiv-A G50m","A","LizenzG50m",null,null,null,null,6]
["1.44.0.00.019","Hatswil Sportschützen","1206481","258407","Kurt","Waldis","Kreuzlingerstr. 83","8590","Romanshorn","CH","Männlich","1986-06-19","Aktiv-A G50m","A","LizenzG50m",null,null,null,null,6]
["1.44.0.00.019","Hatswil Sportschützen","1226295","278222","Patrick","Zihlmann","Obere Hagenwilerstr. 5","8588","Zihlschlacht","CH","Männlich","1987-04-09","Aktiv-A G50m","A","LizenzG50m",null,null,null,null,6]
["1.44.0.00.019","Hatswil Sportschützen","1060780","112695","Urs","Zihlmann","Rümlangerstr. 14","8105","Watt","CH","Männlich","1955-01-17","Aktiv-A G50m","A","LizenzG50m",null,null,null,null,6]
["1.44.0.00.019","Hatswil Sportschützen","1254180","306108","Adele","Zwicker","Neustudenstr. 17","8580","Amriswil","CH","Weiblich","1984-08-20","Aktiv-A G50m","A","LizenzG50m",null,null,null,null,6]
["1.44.0.00.037","Sitterdorf Sportschützen","1721301","791385","Sara","Bartholdi","Löwengartenstrasse 9 ","9400","Rorschach","CH","Weiblich","2001-03-22","Aktiv-A G50m","A","LizenzG50m",null,null,null,null,6]
["1.44.0.00.037","Sitterdorf Sportschützen","1099668","151586","Peter","Beck","Bildstr. 1","9216","Hohentannen","CH","Männlich","1969-05-17","Aktiv-A G50m","A","LizenzG50m",null,null,null,null,6]
["1.44.0.00.037","Sitterdorf Sportschützen","1276037","327967","Diego","Beck","Hauptstr. 6","9216","Hohentannen","CH","Männlich","1994-05-30","Aktiv-A G50m","A","LizenzG50m",null,null,null,null,6]
["1.44.0.00.037","Sitterdorf Sportschützen","1276378","328308","Vanessa","Beck","Zihlschlachtstr. 2","9216","Hohentannen","CH","Weiblich","1996-02-05","Aktiv-A G50m","A","LizenzG50m",null,null,null,null,6]
["1.44.0.00.037","Sitterdorf Sportschützen","1099667","151585","Urs","Beck","Im Pfatt 1","9216","Hohentannen","CH","Männlich","1958-01-14","Aktiv-A G50m","A","LizenzG50m",null,null,null,null,6]
["1.44.0.00.037","Sitterdorf Sportschützen","1117640","169559","Markus","Krucker","Waldparkstr. 3","9220","Bischofszell","CH","Männlich","1966-03-18","Aktiv-A G50m","A","LizenzG50m",null,null,null,null,6]
["1.44.0.00.037","Sitterdorf Sportschützen","1060717","112632","Daniel","Meierhofer","Schoosswiesen 2","9225","Wilen (Gottshaus)","CH","Männlich","1964-11-26","Aktiv-A G50m","A","LizenzG50m",null,null,null,null,6]
["1.44.0.00.037","Sitterdorf Sportschützen","1692760","760514","Christian","Meyer","Austr. 27","9230","Flawil","CH","Männlich","1999-12-27","Aktiv-A G50m","A","LizenzG50m",null,null,null,null,6]
["1.44.0.00.037","Sitterdorf Sportschützen","1039819","16561","Ramona","Mäder","Obere Hagenwilerstr. 2","8588","Zihlschlacht","CH","Weiblich","2008-06-13","Aktiv-A G50m","A","LizenzG50m",null,null,null,null,6]
["1.44.0.00.037","Sitterdorf Sportschützen","1058440","110355","Werner","Schläpfer","Horb 1","9225","Wilen (Gottshaus)","CH","Männlich","1966-02-14","Aktiv-A G50m","A","LizenzG50m",null,null,null,null,6]
["1.44.0.00.037","Sitterdorf Sportschützen","1276038","327968","Marina","Schmitz","Stockenerstr. 2","9220","Bischofszell","CH","Weiblich","1994-11-14","Aktiv-A G50m","A","LizenzG50m",null,null,null,null,6]
["1.44.0.00.037","Sitterdorf Sportschützen","1279484","331415","Marc","Schmitz","Sittpark 5","8589","Sitterdorf","CH","Männlich","1992-09-30","Aktiv-A G50m","A","LizenzG50m",null,null,null,null,6]
["1.44.0.00.037","Sitterdorf Sportschützen","1232444","284371","Werner","Schreiber","Bahnhofstr. 4","9220","Bischofszell","CH","Männlich","1963-04-03","Aktiv-A G50m","A","LizenzG50m",null,null,null,null,6]
["1.44.0.00.037","Sitterdorf Sportschützen","1873074","952502","Fynn","Schönenberger","Hubwiesen 15","8588","Zihlschlacht","CH","Männlich","2010-12-14","Aktiv-A G50m","A","LizenzG50m",null,null,null,null,6]
["1.44.0.00.037","Sitterdorf Sportschützen","1880429","960274","Zoé","Schönenberger","Hubwiesen 15","8588","Zihlschlacht","CH","Weiblich","2007-03-23","Aktiv-A G50m","A","LizenzG50m",null,null,null,null,6]
["1.44.0.00.037","Sitterdorf Sportschützen","1040422","17169","Sophia","Trunz","Tödistr. 18","8572","Berg TG","CH","Weiblich","2010-09-07","Aktiv-A G50m","A","LizenzG50m",null,null,null,null,6]
["1.44.0.00.037","Sitterdorf Sportschützen","1222384","274311","Albert","Wagner","Pestalozzistr. 17","9320","Arbon","CH","Männlich","1963-12-27","Aktiv-A G50m","A","LizenzG50m",null,null,null,null,6]
["1.44.0.00.037","Sitterdorf Sportschützen","1222383","274310","Markus","Wagner","Wattistr. 14","8580","Amriswil","CH","Männlich","1965-12-06","Aktiv-A G50m","A","LizenzG50m",null,null,null,null,6]
["1.17.0.12.127","Wil SG Stadtschützen","1061494","113409","Christian","Baumgartner","Konstanzerstrasse 36","9512","Rossrüti","CH","Männlich","1968-10-08","Aktiv-A G50m","A","LizenzG50m",null,null,null,null,7]
["1.17.0.12.127","Wil SG Stadtschützen","1682580","749682","Ramon","Baumgartner","Bildfeldstrasse 29","9552","Bronschhofen","CH","Männlich","2003-05-21","Aktiv-A G50m","A","LizenzG50m",null,null,null,null,7]
["1.17.0.12.127","Wil SG Stadtschützen","2308339","34430","Vito","Caponio","Ebnifeld 7","9523","Züberwangen","CH","Männlich","2014-01-22","Aktiv-A G50m","A","LizenzG50m",null,null,null,null,7]
["1.17.0.12.127","Wil SG Stadtschützen","2396595","52993","Timon","Choi","Eggstrasse 18","9242","Oberuzwil","CH","Männlich","2010-04-08","Aktiv-A G50m","A","LizenzG50m",null,null,null,null,7]
["1.17.0.12.127","Wil SG Stadtschützen","1246704","298631","Hansruedi","Döbeli","Feldstr. 7","8370","Sirnach","CH","Männlich","1955-12-13","Aktiv-A G50m","A","LizenzG50m",null,null,null,null,7]
["1.17.0.12.127","Wil SG Stadtschützen","2367171","46367","Petra Eszter","Filemon","Waldeggstr. 9","9602","Bazenheid","CH","Weiblich","2011-04-27","Aktiv-A G50m","A","LizenzG50m",null,null,null,null,7]
["1.17.0.12.127","Wil SG Stadtschützen","1061194","113109","Martin","Gyger","Kirchgasse 23","9500","Wil SG","CH","Männlich","1985-09-10","Aktiv-A G50m","A","LizenzG50m",null,null,null,null,7]
["1.17.0.12.127","Wil SG Stadtschützen","1061195","113110","Roland","Gyger","Gurtberg 1003","9622","Krinau","CH","Männlich","1953-07-04","Aktiv-A G50m","A","LizenzG50m",null,null,null,null,7]
["1.17.0.12.127","Wil SG Stadtschützen","1633584","697499","Tamara","Hildebrand","Hubstrasse 37","9500","Wil SG","CH","Weiblich","2001-08-06","Aktiv-A G50m","A","LizenzG50m",null,null,null,null,7]
["1.17.0.12.127","Wil SG Stadtschützen","1239060","290987","Stephan","Hildebrand","obere Rittbergstr. 7","9615","Dietfurt","CH","Männlich","1988-06-01","Aktiv-B G50m","B","LizenzG50m",null,null,null,null,7]
["1.17.0.12.127","Wil SG Stadtschützen","1718709","788358","Moana","Hollenweger","Im Grund 19","9553","Bettwiesen","CH","Weiblich","2004-07-16","Aktiv-A G50m","A","LizenzG50m",null,null,null,null,7]
["1.17.0.12.127","Wil SG Stadtschützen","2270875","30323","Romy","Riedener","Grünaustrasse 2","9602","Bazenheid","CH","Weiblich","2011-05-31","Aktiv-A G50m","A","LizenzG50m",null,null,null,null,7]
["1.17.0.12.127","Wil SG Stadtschützen","1775820","849741","Lea","Rügge","St.Gallerstrasse 27","9500","Wil SG","CH","Weiblich","2004-04-09","Aktiv-A G50m","A","LizenzG50m",null,null,null,null,7]
["1.17.0.12.127","Wil SG Stadtschützen","1061197","113112","Sonja","Siegenthaler","Feldwiesstr. 2","9621","Oberhelfenschwil","CH","Weiblich","1980-10-20","Aktiv-B G50m","B","LizenzG50m",null,null,null,null,7]
["1.17.0.12.127","Wil SG Stadtschützen","1040447","17194","Svea","Siegenthaler","Feldwiesstr. 2","9621","Oberhelfenschwil","CH","Weiblich","2012-03-19","Aktiv-A G50m","A","LizenzG50m",null,null,null,null,7]
["1.17.0.12.127","Wil SG Stadtschützen","1061563","113478","Norbert","Ziegler","Dorfstr. 19","9514","Wuppenau","CH","Männlich","1952-08-04","Aktiv-A G50m","A","LizenzG50m",null,null,null,null,7]
["1.20.0.06.107","Märwil Schützenverein","1799625","875331","Jasmin","Brönnimann","Weiblingen 7","8577","Schönholzerswilen","CH","Weiblich","2005-12-13","Aktiv-A G50m","A","LizenzG50m",null,null,null,null,7]
["1.20.0.06.107","Märwil Schützenverein","1039605","16347","Silvan","Bühler","Hauptstr. 27a","9556","Affeltrangen","CH","Männlich","2009-03-09","Aktiv-A G50m","A","LizenzG50m",null,null,null,null,7]
["1.20.0.06.107","Märwil Schützenverein","1025465","2069","Florian","Bühler","Hauptstr. 27 a","9556","Affeltrangen","CH","Männlich","2007-10-03","Aktiv-A G50m","A","LizenzG50m",null,null,null,null,7]
["1.20.0.06.107","Märwil Schützenverein","1617863","680340","Luca","Eberhart","Schulstrasse 4A","9517","Mettlen","CH","Männlich","1999-12-10","Aktiv-A G50m","A","LizenzG50m",null,null,null,null,7]
["1.20.0.06.107","Märwil Schützenverein","2365293","45545","Vivien","Felix","","9502","Braunau","CH","Weiblich","2009-06-13","Aktiv-A G50m","A","LizenzG50m",null,null,null,null,7]
["1.20.0.06.107","Märwil Schützenverein","1131287","183207","Thomas","Felix","Himmenreich 9C","9562","Märwil","CH","Männlich","1971-09-19","Aktiv-A G50m","A","LizenzG50m",null,null,null,null,7]
["1.20.0.06.107","Märwil Schützenverein","1025456","2060","Maureen","Frei","Huebrüti 1","9562","Märwil","CH","Weiblich","2009-11-13","Aktiv-A G50m","A","LizenzG50m",null,null,null,null,7]
["1.20.0.06.107","Märwil Schützenverein","1796628","872125","Fabian","Frei","Huebrüti 1","9562","Märwil","CH","Männlich","2006-03-04","Aktiv-A G50m","A","LizenzG50m",null,null,null,null,7]
["1.20.0.06.107","Märwil Schützenverein","1796637","872134","Timo","Fröhlich","Kirchstr. 17","9562","Märwil","CH","Männlich","2005-04-28","Aktiv-A G50m","A","LizenzG50m",null,null,null,null,7]
["1.20.0.06.107","Märwil Schützenverein","1796627","872124","Jndira","Fässler","Gehrenstr. 28","9556","Affeltrangen","CH","Weiblich","2007-07-06","Aktiv-A G50m","A","LizenzG50m",null,null,null,null,7]
["1.20.0.06.107","Märwil Schützenverein","1755180","827599","Yannis","Greminger","Häusern 3","8577","Schönholzerswilen","CH","Männlich","2005-01-03","Aktiv-A G50m","A","LizenzG50m",null,null,null,null,7]
["1.20.0.06.107","Märwil Schützenverein","1061164","113079","Erich","Gurtner","Dübingerstr. 32","8555","Müllheim Dorf","CH","Männlich","1967-07-15","Aktiv-A G50m","A","LizenzG50m",null,null,null,null,7]
["1.20.0.06.107","Märwil Schützenverein","2374777","49593","Joe","Keller","Lättestrasse 6","9562","Buch b. Märwil","CH","Männlich","2015-12-14","Aktiv-A G50m","A","LizenzG50m",null,null,null,null,7]
["1.20.0.06.107","Märwil Schützenverein","1385292","437226","Philipp W.","Kessler","Frühmessstrasse 7","8272","Ermatingen","CH","Männlich","1982-07-13","Aktiv-A G50m","A","LizenzG50m",null,null,null,null,7]
["1.20.0.06.107","Märwil Schützenverein","1755178","827596","Anja","Koch","Oberhausen 92","9502","Braunau","CH","Weiblich","2002-02-17","Aktiv-A G50m","A","LizenzG50m",null,null,null,null,7]
["1.20.0.06.107","Märwil Schützenverein","2263554","27987","Périne","Kuratli","Riethofstrasse 4","9556","Zezikon","CH","Weiblich","2007-05-06","Aktiv-A G50m","A","LizenzG50m",null,null,null,null,7]
["1.20.0.06.107","Märwil Schützenverein","1247459","299386","Irene","Länzlinger","Weinfelderstr. 8","8514","Amlikon-Bissegg","CH","Weiblich","1962-03-10","Aktiv-A G50m","A","LizenzG50m",null,null,null,null,7]
["1.20.0.06.107","Märwil Schützenverein","2374778","49594","Flavio","Mancarella","Karlishuebstr. 11","9554","Tägerschen","CH","Männlich","2015-03-17","Aktiv-A G50m","A","LizenzG50m",null,null,null,null,7]
["1.20.0.06.107","Märwil Schützenverein","1036304","13014","Lorin","Petzmann","Matzingerstr. 22","9506","Lommis","CH","Männlich","2010-08-25","Aktiv-A G50m","A","LizenzG50m",null,null,null,null,7]
["1.20.0.06.107","Märwil Schützenverein","1036305","13015","Jesse","Plüer","Sitegässli 18","9562","Märwil","CH","Männlich","2008-05-22","Aktiv-A G50m","A","LizenzG50m",null,null,null,null,7]
["1.20.0.06.107","Märwil Schützenverein","1270147","322077","Sandro","Ramsauer","Schlossgasse 6","8570","Weinfelden","CH","Männlich","1995-05-16","Aktiv-A G50m","A","LizenzG50m",null,null,null,null,7]
["1.20.0.06.107","Märwil Schützenverein","2374781","49597","Timo","Schönholzer","Sitegässli 4","9562","Märwil","CH","Männlich","2015-01-27","Aktiv-A G50m","A","LizenzG50m",null,null,null,null,7]
["1.20.0.06.107","Märwil Schützenverein","1682599","749705","Denise","Stehrenberger","Im Zentrum 6","9542","Münchwilen TG","CH","Weiblich","1962-11-25","Aktiv-A G50m","A","LizenzG50m",null,null,null,null,7]
["1.20.0.06.107","Märwil Schützenverein","2374780","49596","Dario","Süess","Oberoppikon 14","9565","Oppikon","CH","Männlich","2014-12-31","Aktiv-A G50m","A","LizenzG50m",null,null,null,null,7]
["1.20.0.06.107","Märwil Schützenverein","1136815","188735","Heinz","Zahnd","Oberbrunnenstrasse 15","8514","Amlikon-Bissegg","CH","Männlich","1964-10-27","Aktiv-A G50m","A","LizenzG50m",null,null,null,null,7]
["1.20.0.06.107","Märwil Schützenverein","1682600","749706","Ivo","Zollet","Im Eigen 3","9542","Münchwilen TG","CH","Männlich","1963-09-28","Aktiv-A G50m","A","LizenzG50m",null,null,null,null,7]
["1.20.0.08.179","Weinfelden Schützengesellschaft","1763095","836261","Robin","Bissegger","Frauenfelderstr. 66","8570","Weinfelden","CH","Männlich","2004-06-07","Aktiv-A G50m","A","LizenzG50m",null,null,null,null,7]
["1.20.0.08.179","Weinfelden Schützengesellschaft","2289691","32353","Philipp","Diener","Frauenfelderstrasse 99","8570","Weinfelden","CH","Männlich","2006-08-31","Aktiv-A G50m","A","LizenzG50m",null,null,null,null,7]
["1.20.0.08.179","Weinfelden Schützengesellschaft","1061317","113232","Andreas","Gerber","Gartenstr. 10","8570","Weinfelden","CH","Männlich","1974-01-20","Aktiv-A G50m","A","LizenzG50m",null,null,null,null,7]
["1.20.0.08.179","Weinfelden Schützengesellschaft","1255664","307592","Yvonne","Gerber","Gartenstr. 10","8570","Weinfelden","CH","Weiblich","1978-01-13","Aktiv-A G50m","A","LizenzG50m",null,null,null,null,7]
["1.20.0.08.179","Weinfelden Schützengesellschaft","1573232","634899","Sarina","Hitz","Prestenbergstr. 7","8576","Mauren","CH","Weiblich","2000-09-05","Aktiv-A G50m","A","LizenzG50m",null,null,null,null,7]
["1.20.0.08.179","Weinfelden Schützengesellschaft","1054423","106337","Christoph","Kamm","Heimenhofen 103","8586","Andwil TG","CH","Männlich","1956-05-12","Aktiv-A G50m","A","LizenzG50m",null,null,null,null,7]
["1.20.0.08.179","Weinfelden Schützengesellschaft","1057143","109058","Roman","Mästinger","Frauenfelderstr. 47A","8570","Weinfelden","CH","Männlich","1955-08-05","Aktiv-A G50m","A","LizenzG50m",null,null,null,null,7]
["1.20.0.08.179","Weinfelden Schützengesellschaft","1873069","952495","Philipp","Oettli","Sonnenstr. 5","8570","Weinfelden","CH","Männlich","2006-12-21","Aktiv-A G50m","A","LizenzG50m",null,null,null,null,7]
["1.20.0.08.179","Weinfelden Schützengesellschaft","1030840","5588","Michael","Schläpfer","Haustr. 22","8570","Weinfelden","CH","Männlich","2009-08-10","Aktiv-A G50m","A","LizenzG50m",null,null,null,null,7]
["1.20.0.08.179","Weinfelden Schützengesellschaft","1870290","949617","Manuel","Schumacher","Bachtobelstr. 34","8570","Weinfelden","CH","Männlich","2003-11-01","Aktiv-A G50m","A","LizenzG50m",null,null,null,null,7]
["1.20.0.08.179","Weinfelden Schützengesellschaft","1906014","986850","Ken","Stieger","Bürglenstrasse 4","8570","Weinfelden","CH","Männlich","2006-07-31","Aktiv-A G50m","A","LizenzG50m",null,null,null,null,7]
["1.20.0.08.179","Weinfelden Schützengesellschaft","1038721","32349","Robin","Thalmann","Hinterdorf 5","8564","Wagerswil","CH","Männlich","2012-07-27","Aktiv-A G50m","A","LizenzG50m",null,null,null,null,7]
["1.20.0.08.179","Weinfelden Schützengesellschaft","1057138","109053","Markus","Wyss","Bergstr. 11","9220","Bischofszell","CH","Männlich","1945-02-25","Aktiv-A G50m","A","LizenzG50m",null,null,null,null,7]
["1.44.0.00.006","Bazenheid Sportschützen","1704453","772919","Yvonne","Bodenmann","Schäfliwis 17","9104","Waldstatt","CH","Weiblich","1980-02-19","Aktiv-A G50m","A","LizenzG50m",null,null,null,null,7]
["1.44.0.00.006","Bazenheid Sportschützen","1740441","811737","Miguel","Carpio Santos","Hubstrasse 37","9500","Wil SG","CH","Männlich","1998-07-22","Aktiv-A G50m","A","LizenzG50m",null,null,null,null,7]
["1.44.0.00.006","Bazenheid Sportschützen","1246704","298631","Hansruedi","Döbeli","Feldstr. 7","8370","Sirnach","CH","Männlich","1955-12-13","Aktiv-B G50m","B","LizenzG50m",null,null,null,null,7]
["1.44.0.00.006","Bazenheid Sportschützen","1255767","307695","Hansruedi","Grob","Wellhauserweg 4","8500","Frauenfeld","CH","Männlich","1944-06-30","Aktiv-A G50m","A","LizenzG50m",null,null,null,null,7]
["1.44.0.00.006","Bazenheid Sportschützen","1239060","290987","Stephan","Hildebrand","obere Rittbergstr. 7","9615","Dietfurt","CH","Männlich","1988-06-01","Aktiv-A G50m","A","LizenzG50m",null,null,null,null,7]
["1.44.0.00.006","Bazenheid Sportschützen","1633584","697499","Tamara","Hildebrand","Hubstrasse 37","9500","Wil SG","CH","Weiblich","2001-08-06","Aktiv-B G50m","B","LizenzG50m",null,null,null,null,7]
["1.44.0.00.006","Bazenheid Sportschützen","1204351","256277","Urs","Hofstetter","Hurnenstr.12","8360","Wallenwil","CH","Männlich","1955-12-02","Aktiv-A G50m","A","LizenzG50m",null,null,null,null,7]
["1.44.0.00.006","Bazenheid Sportschützen","1670380","736429","Nicolas","Hollenstein","Flurstrasse 3","9602","Bazenheid","CH","Männlich","1996-12-31","Aktiv-A G50m","A","LizenzG50m",null,null,null,null,7]
["1.44.0.00.006","Bazenheid Sportschützen","1069151","121066","Jakob","Rey","Rebenstr. 11","9524","Zuzwil SG","CH","Männlich","1955-06-18","Aktiv-A G50m","A","LizenzG50m",null,null,null,null,7]
["1.44.0.00.006","Bazenheid Sportschützen","1059601","111516","Heinz","Ruckstuhl","Zehntstadel 7","9244","Niederuzwil","CH","Männlich","1959-06-04","Aktiv-A G50m","A","LizenzG50m",null,null,null,null,7]
["1.44.0.00.006","Bazenheid Sportschützen","1704985","773457","Silvia","Scherrer","Wolfikon 99","9533","Kirchberg SG","CH","Weiblich","1998-11-06","Aktiv-A G50m","A","LizenzG50m",null,null,null,null,7]
["1.44.0.00.006","Bazenheid Sportschützen","1138593","190513","Emil","Senn","Mettlenstr. 5","9523","Züberwangen","CH","Männlich","1947-01-29","Aktiv-A G50m","A","LizenzG50m",null,null,null,null,7]
["1.44.0.00.006","Bazenheid Sportschützen","1060748","112663","Reto","Sennhauser","Unterdorf 1","9607","Mosnang","CH","Männlich","1975-07-21","Aktiv-A G50m","A","LizenzG50m",null,null,null,null,7]
["1.44.0.00.006","Bazenheid Sportschützen","2251737","15143","Richard","Stäheli","Breitestrasse 14","9532","Rickenbach b. Wil","CH","Männlich","1991-06-19","Aktiv-A G50m","A","LizenzG50m",null,null,null,null,7]
["1.44.0.00.006","Bazenheid Sportschützen","1670379","736427","Monja","Thalmann","Oberplattenstrasse 4","9620","Lichtensteig","CH","Weiblich","1997-09-19","Aktiv-A G50m","A","LizenzG50m",null,null,null,null,7]
["1.44.0.00.006","Bazenheid Sportschützen","1093793","145710","Fredy","Tobler","Fliegeneggstr. 5","9555","Tobel","CH","Männlich","1957-04-18","Aktiv-A G50m","A","LizenzG50m",null,null,null,null,7]
["1.44.0.00.006","Bazenheid Sportschützen","1060750","112665","Karl","Ursprung","Höhenweg 8","8586","Riedt b. Erlen","CH","Männlich","1962-05-11","Aktiv-A G50m","A","LizenzG50m",null,null,null,null,7]
["1.44.0.00.006","Bazenheid Sportschützen","1060749","112664","Bruno","Ursprung","Bahnhofstr. 25","9553","Bettwiesen","CH","Männlich","1965-05-09","Aktiv-A G50m","A","LizenzG50m",null,null,null,null,7]
["1.44.0.00.006","Bazenheid Sportschützen","1061228","113143","Norbert","Werz","Oberdorfstr. 9","9532","Rickenbach b. Wil","CH","Männlich","1956-04-09","Aktiv-A G50m","A","LizenzG50m",null,null,null,null,7]
["1.44.0.00.006","Bazenheid Sportschützen","1740445","811743","Thomas","Wiget","Jägerstrasse 3","9213","Hauptwil","CH","Männlich","1996-03-19","Aktiv-A G50m","A","LizenzG50m",null,null,null,null,7]
["1.44.0.00.006","Bazenheid Sportschützen","2307729","34325","Jasmin","Zurlinden","Herdernstrasse 2","8360","Eschlikon TG","CH","Weiblich","2007-02-08","Aktiv-A G50m","A","LizenzG50m",null,null,null,null,7]
["1.44.0.00.010","Dettighofen Sportschützen","1060811","112726","Hardy","Barth","Südrainstr. 10","8508","Homburg","CH","Männlich","1934-07-09","Aktiv-A G50m","A","LizenzG50m",null,null,null,null,7,""]
["1.44.0.00.010","Dettighofen Sportschützen","1060812","112727","Roman","Barth","Südrainstr. 10","8508","Homburg","CH","Männlich","1971-02-02","Aktiv-A G50m","A","LizenzG50m",null,null,null,null,7,""]
["1.44.0.00.010","Dettighofen Sportschützen","2279119","30665","Levin","Damann","Liebenfelserstr. 5","8506","Lanzenneunforn","CH","Männlich","2011-08-14","Aktiv-A G50m","A","LizenzG50m",null,null,null,null,7,""]
["1.44.0.00.010","Dettighofen Sportschützen","1043700","20462","Jda","Fröhlich","Lindenstr. 9","8558","Raperswilen","CH","Weiblich","1952-03-18","Aktiv-A G50m","A","LizenzG50m",null,null,null,null,7,""]
["1.44.0.00.010","Dettighofen Sportschützen","1060823","112738","Stephan","Fröhlich","Sonnenhaldenstr. 6","8508","Homburg","CH","Männlich","1978-09-19","Aktiv-A G50m","A","LizenzG50m",null,null,null,null,7,""]
["1.44.0.00.010","Dettighofen Sportschützen","1060822","112737","Roland","Fröhlich","Lindenstr. 9","8558","Raperswilen","CH","Männlich","1952-09-21","Aktiv-A G50m","A","LizenzG50m",null,null,null,null,7,""]
["1.44.0.00.010","Dettighofen Sportschützen","1061481","113396","Urs","Fuster","unteres Ziel 3","9050","Appenzell","CH","Männlich","1953-08-10","Aktiv-B G50m","B","LizenzG50m",null,null,null,null,7,""]
["1.44.0.00.010","Dettighofen Sportschützen","1226225","278152","Claudia","Gantenbein","Bachstr. 14","8505","Pfyn","CH","Weiblich","1976-01-10","Aktiv-A G50m","A","LizenzG50m",null,null,null,null,7,""]
["1.44.0.00.010","Dettighofen Sportschützen","1111299","163217","Nelly","Ganz","Riedhofstr. 90","8408","Winterthur","CH","Weiblich","1948-01-29","Aktiv-A G50m","A","LizenzG50m",null,null,null,null,7,""]
["1.44.0.00.010","Dettighofen Sportschützen","2265338","29063","Kay","Greutmann","Baumgartenstr. 16","8505","Dettighofen","CH","Männlich","2010-09-25","Aktiv-A G50m","A","LizenzG50m",null,null,null,null,7,""]
["1.44.0.00.010","Dettighofen Sportschützen","1039169","15910","Linn","Hagen","Dorfstr. 14","8536","Hüttwilen","CH","Weiblich","2009-08-11","Aktiv-A G50m","A","LizenzG50m",null,null,null,null,7,""]
["1.44.0.00.010","Dettighofen Sportschützen","1032537","9221","Roland","Hagen","Unteres Steimürli 3","8536","Hüttwilen","CH","Männlich","1965-04-09","Aktiv-A G50m","A","LizenzG50m",null,null,null,null,7,""]
["1.44.0.00.010","Dettighofen Sportschützen","1061529","113444","Armin","Kaufmann","Hofackerstrasse 3","8471","Oberwil (Dägerlen)","CH","Männlich","1954-07-17","Aktiv-A G50m","A","LizenzG50m",null,null,null,null,7,""]
["1.44.0.00.010","Dettighofen Sportschützen","1025897","2504","Joel Leon","Kutter","Breitwies 7","8532","Weiningen TG","CH","Männlich","2010-01-03","Aktiv-A G50m","A","LizenzG50m",null,null,null,null,7,""]
["1.44.0.00.010","Dettighofen Sportschützen","1239805","291732","Nadja","Kübler","Oberi Breiti 6","8500","Gerlikon","CH","Weiblich","1995-10-03","Aktiv-A G50m","A","LizenzG50m",null,null,null,null,7,""]
["1.44.0.00.010","Dettighofen Sportschützen","1066263","118178","Fridolin","Kühne","Panoramaweg 5","8558","Raperswilen","CH","Männlich","1958-02-10","Aktiv-A G50m","A","LizenzG50m",null,null,null,null,7,""]
["1.44.0.00.010","Dettighofen Sportschützen","1060837","112752","Hansjörg","Lang","Oberhofstr. 9","8265","Mammern","CH","Männlich","1948-06-06","Aktiv-A G50m","A","LizenzG50m",null,null,null,null,7,""]
["1.44.0.00.010","Dettighofen Sportschützen","1114176","166094","Marco","Meier","In der Breite 2","8532","Warth TG","CH","Männlich","1973-04-21","Aktiv-A G50m","A","LizenzG50m",null,null,null,null,7,""]
["1.44.0.00.010","Dettighofen Sportschützen","1679422","746282","Julia","Meier","In der Breite 2","8532","Warth","CH","Weiblich","1976-11-27","Aktiv-A G50m","A","LizenzG50m",null,null,null,null,7,""]
["1.44.0.00.010","Dettighofen Sportschützen","1207663","259589","Fabian","Meili","Oehningerstr. 10","8260","Stein am Rhein","CH","Männlich","1991-04-21","Aktiv-A G50m","A","LizenzG50m",null,null,null,null,7,""]
["1.44.0.00.010","Dettighofen Sportschützen","1096144","148061","Bernhard","Meili","Steckbornerstr. 30","8535","Herdern","CH","Männlich","1950-07-20","Aktiv-A G50m","A","LizenzG50m",null,null,null,null,7,""]
["1.44.0.00.010","Dettighofen Sportschützen","2283367","31526","Sophia","Miesen","","8506","Lanzenneunforn","CH","Weiblich","2010-07-25","Aktiv-A G50m","A","LizenzG50m",null,null,null,null,7,""]
["1.44.0.00.010","Dettighofen Sportschützen","1686729","754279","Jan","Mäder","Ifangweg 4","8508","Homburg","CH","Männlich","2002-09-21","Aktiv-A G50m","A","LizenzG50m",null,null,null,null,7,""]
["1.44.0.00.010","Dettighofen Sportschützen","1262339","314267","Thomas","Mäder","Ifangweg 4","8508","Homburg","CH","Männlich","1975-04-22","Aktiv-A G50m","A","LizenzG50m",null,null,null,null,7,""]
["1.44.0.00.010","Dettighofen Sportschützen","1260431","312359","Pascal","Perren","Zehntenstr. 7","8536","Hüttwilen","CH","Männlich","1988-04-30","Aktiv-A G50m","A","LizenzG50m",null,null,null,null,7,""]
["1.44.0.00.010","Dettighofen Sportschützen","1078065","129981","Mischa","Peter","Hauptstr. 9","8512","Thundorf","CH","Männlich","1976-03-01","Aktiv-A G50m","A","LizenzG50m",null,null,null,null,7,""]
["1.44.0.00.010","Dettighofen Sportschützen","1277057","328987","Christoff","Rosenkranz","Oberdorfstr. 4","8505","Dettighofen","CH","Männlich","1959-04-22","Aktiv-A G50m","A","LizenzG50m",null,null,null,null,7,""]
["1.44.0.00.010","Dettighofen Sportschützen","1032539","9223","Marcel","Salathé","Zehntenstr. 8a","8536","Hüttwilen","CH","Männlich","1963-06-30","Aktiv-A G50m","A","LizenzG50m",null,null,null,null,7,""]
["1.44.0.00.010","Dettighofen Sportschützen","1346380","398312","Ruedi","Salzmann","Steckbornerstr. 14","8535","Herdern","CH","Männlich","1961-03-01","Aktiv-A G50m","A","LizenzG50m",null,null,null,null,7,""]
["1.44.0.00.010","Dettighofen Sportschützen","1061475","113390","Roger","Schmied","Bettackerstr. 18","8556","Wigoltingen","CH","Männlich","1978-01-15","Aktiv-A G50m","A","LizenzG50m",null,null,null,null,7,""]
["1.44.0.00.010","Dettighofen Sportschützen","1175138","227063","Beatrix","Spuhler","Am Brunnen 6","5332","Rekingen","CH","Weiblich","1967-04-05","Aktiv-A G50m","A","LizenzG50m",null,null,null,null,7,""]
["1.44.0.00.010","Dettighofen Sportschützen","1335404","387336","Mike","Waldvogel","Geigenhofstrasse 8","8553","Hüttlingen","CH","Männlich","1988-09-21","Aktiv-A G50m","A","LizenzG50m",null,null,null,null,7,""]
["1.44.0.00.010","Dettighofen Sportschützen","1776550","850496","Oliver","Wettstein","","8532","Weiningen","CH","Männlich","2003-03-21","Aktiv-A G50m","A","LizenzG50m",null,null,null,null,7,""]
["1.44.0.00.010","Dettighofen Sportschützen","2342519","42418","Manuel","Zulauf","Rabenweg 3","8264","Eschenz","CH","Männlich","2010-09-17","Aktiv-A G50m","A","LizenzG50m",null,null,null,null,7,""]
["1.44.0.00.046","Wängi Sportschützen","1089145","141062","Erwin","Brönnimann","Weiblingen 7","8577","Schönholzerswilen","CH","Männlich","1965-03-06","Aktiv-A G50m","A","LizenzG50m",null,null,null,null,7]
["1.44.0.00.046","Wängi Sportschützen","1250073","302001","Armin","Eugster","Schulweg 6","8353","Elgg","CH","Männlich","1964-03-16","Aktiv-A G50m","A","LizenzG50m",null,null,null,null,7]
["1.44.0.00.046","Wängi Sportschützen","1630267","693836","Sven","Frei","Nelkenweg 3","8360","Wallenwil","CH","Männlich","1998-10-01","Aktiv-A G50m","A","LizenzG50m",null,null,null,null,7]
["1.44.0.00.046","Wängi Sportschützen","2267606","29659","Adam","Hlavac","Brühlwiesenstrasse 24","9545","Wängi","CH","Männlich","2012-01-16","Aktiv-A G50m","A","LizenzG50m",null,null,null,null,7]
["1.44.0.00.046","Wängi Sportschützen","1061424","113339","Fritz","Häsler","Kalthäusern 48","9508","Weingarten-Kalth","CH","Männlich","1940-07-11","Aktiv-A G50m","A","LizenzG50m",null,null,null,null,7]
["1.44.0.00.046","Wängi Sportschützen","1051286","103200","Josef","Jöhl","Im Juch 9","9548","Matzingen","CH","Männlich","1936-04-13","Aktiv-A G50m","A","LizenzG50m",null,null,null,null,7]
["1.44.0.00.046","Wängi Sportschützen","1171951","223876","Andreas","Kuttelwascher","Ziegeleistr. 11","8500","Frauenfeld","CH","Männlich","1985-02-17","Aktiv-A G50m","A","LizenzG50m",null,null,null,null,7]
["1.44.0.00.046","Wängi Sportschützen","1170969","222894","Andreas","Kuttelwascher","Geeren 2 / Ifwil","8362","Balterswil","CH","Männlich","1961-08-19","Aktiv-A G50m","A","LizenzG50m",null,null,null,null,7]
["1.44.0.00.046","Wängi Sportschützen","1128120","180040","Martin","Rutz","Frauenfelderstr. 37","8514","Amlikon-Bissegg","CH","Männlich","1970-02-17","Aktiv-A G50m","A","LizenzG50m",null,null,null,null,7]
["1.44.0.00.046","Wängi Sportschützen","1184221","236147","Benny","Schneider","Sonnhaldenstr. 7","8362","Balterswil","CH","Männlich","1961-04-13","Aktiv-A G50m","A","LizenzG50m",null,null,null,null,7]
["1.44.0.00.046","Wängi Sportschützen","1061430","113345","Albert","Schwager","Tiefenstein 11","8354","Hofstetten ZH","CH","Männlich","1955-04-15","Aktiv-A G50m","A","LizenzG50m",null,null,null,null,7]
["1.44.0.00.046","Wängi Sportschützen","1226043","277970","Denise","Schwager","Tiefenstein  6","8354","Hofstetten ZH","CH","Weiblich","1990-11-13","Aktiv-A G50m","A","LizenzG50m",null,null,null,null,7]
["1.44.0.00.046","Wängi Sportschützen","1901836","982549","Peter","Walser","Bühlstr. 8","9545","Wängi","CH","Männlich","1949-08-29","Aktiv-A G50m","A","LizenzG50m",null,null,null,null,7]
["1.44.0.00.046","Wängi Sportschützen","1034949","11647","Amara","Windlin","Wiesengrund 3","9514","Wuppenau","CH","Weiblich","2007-03-22","Aktiv-A G50m","A","LizenzG50m",null,null,null,null,7]
["1.44.0.00.046","Wängi Sportschützen","1041285","18035","Elisabeth","Windlin","Frauenfelderstrasse","8514","Amlikon-Bissegg","CH","Weiblich","1970-07-26","Aktiv-A G50m","A","LizenzG50m",null,null,null,null,7]
["1.44.0.00.046","Wängi Sportschützen","1114038","165956","Karl","Wirz","Rietacker 4","9548","Matzingen","CH","Männlich","1948-07-03","Aktiv-A G50m","A","LizenzG50m",null,null,null,null,7]
["1.20.0.05.096","Kreuzlingen Schützenverein","2304039","33825","Liliana","Benke","Hauptstrasse 37","8572","Berg TG","CH","Weiblich","2009-09-18","Aktiv-A G50m","A","LizenzG50m",null,null,null,null,8]
["1.20.0.05.096","Kreuzlingen Schützenverein","1061122","113037","Peter","Freund","Weiherstr. 20 a","8280","Kreuzlingen","CH","Männlich","1952-12-29","Aktiv-A G50m","A","LizenzG50m",null,null,null,null,8]
["1.20.0.05.096","Kreuzlingen Schützenverein","1764582","837868","Lorenzo Vito","Gouveia","Seefeldstr. 2","8280","Kreuzlingen","CH","Weiblich","2004-01-05","Aktiv-A G50m","A","LizenzG50m",null,null,null,null,8]
["1.20.0.05.096","Kreuzlingen Schützenverein","1061381","113296","Marcel","Haller","Ackerstr. 16b","8266","Steckborn","CH","Männlich","1958-02-12","Aktiv-A G50m","A","LizenzG50m",null,null,null,null,8]
["1.20.0.05.096","Kreuzlingen Schützenverein","2366399","46117","Ayana","Koch","Bächlistrasse 21","8280","Kreuzlingen","CH","Weiblich","2013-06-07","Aktiv-A G50m","A","LizenzG50m",null,null,null,null,8]
["1.20.0.05.096","Kreuzlingen Schützenverein","1637918","702217","Seraina","Krucker","Flurhofstrasse 31a","8572","Andhausen","CH","Weiblich","2002-04-12","Aktiv-A G50m","A","LizenzG50m",null,null,null,null,8]
["1.20.0.05.096","Kreuzlingen Schützenverein","1863901","942901","Chiara","Marciello","Hauptstr. 21","8572","Berg TG","CH","Weiblich","2008-07-04","Aktiv-A G50m","A","LizenzG50m",null,null,null,null,8]
["1.20.0.05.096","Kreuzlingen Schützenverein","1061130","113045","Alfred","Müller","Hauptstr. 134","8274","Tägerwilen","CH","Männlich","1951-12-12","Aktiv-A G50m","A","LizenzG50m",null,null,null,null,8]
["1.20.0.05.096","Kreuzlingen Schützenverein","1745675","817413","Chris","Nehmer","Hauptstr. 13b","8280","Kreuzlingen","CH","Männlich","1973-01-04","Aktiv-A G50m","A","LizenzG50m",null,null,null,null,8]
["1.20.0.05.096","Kreuzlingen Schützenverein","1039496","16237","Yannic","Rüegger","Remisbergstr. 56","8280","Kreuzlingen","CH","Männlich","2005-04-05","Aktiv-A G50m","A","LizenzG50m",null,null,null,null,8]
["1.20.0.05.096","Kreuzlingen Schützenverein","1061387","113302","Werner","Schäfli","Ackerstr. 1","8266","Steckborn","CH","Männlich","1978-10-03","Aktiv-A G50m","A","LizenzG50m",null,null,null,null,8]
["1.20.0.05.096","Kreuzlingen Schützenverein","1061136","113051","Markus","Steiger","Sonnenstr. 11","8274","Tägerwilen","CH","Männlich","1959-06-14","Aktiv-A G50m","A","LizenzG50m",null,null,null,null,8]
["1.20.0.05.096","Kreuzlingen Schützenverein","2364453","45327","Cyrill","Steiger","Sonnenstrasse 11","8274","Tägerwilen","CH","Männlich","2006-01-21","Aktiv-A G50m","A","LizenzG50m",null,null,null,null,8]
["1.20.0.05.096","Kreuzlingen Schützenverein","1061379","113294","Nicole","Storchenegger","Riethaldenstr. 10","8266","Steckborn","CH","Weiblich","1970-02-23","Aktiv-A G50m","A","LizenzG50m",null,null,null,null,8]
["1.20.0.05.096","Kreuzlingen Schützenverein","1254686","306614","Matthias","Wolfender","Waldhofstr. 14","8573","Siegershausen","CH","Männlich","1993-12-28","Aktiv-A G50m","A","LizenzG50m",null,null,null,null,8]
["1.44.0.00.008","Bottighofen Sportschützen","1060782","112697","Kurt","Brack","Bromstr. 10","8598","Bottighofen","CH","Männlich","1971-12-06","Aktiv-A G50m","A","LizenzG50m",null,null,null,null,8]
["1.44.0.00.008","Bottighofen Sportschützen","1060783","112698","Markus","Brunschwiler","Pfaffenwiesstr. 6","8598","Bottighofen","CH","Männlich","1956-05-13","Aktiv-A G50m","A","LizenzG50m",null,null,null,null,8]
["1.44.0.00.008","Bottighofen Sportschützen","2319477","39299","Pasquale","Nigro","","8598","Bottighofen","CH","Männlich","1981-12-06","Aktiv-A G50m","A","LizenzG50m",null,null,null,null,8]
["1.44.0.00.008","Bottighofen Sportschützen","1277069","328999","Maurizio","Roviaro","Kappelerweg 24","8570","Weinfelden","CH","Männlich","1959-09-03","Aktiv-A G50m","A","LizenzG50m",null,null,null,null,8]
["1.44.0.00.008","Bottighofen Sportschützen","1277062","328992","Marco","Roviaro","Hauptstrasse 15","8564","Engwilen","CH","Männlich","1987-04-16","Aktiv-A G50m","A","LizenzG50m",null,null,null,null,8]
["1.44.0.00.013","Schaffhausen Sportschützen Munot","1055288","107202","Franz ","Baumann","Sägistieg 10","8240","Thayngen","CH","Männlich","1972-11-01","Aktiv-A G50m","A","LizenzG50m",null,null,null,null,8]
["1.44.0.00.013","Schaffhausen Sportschützen Munot","1134952","186872","Cédric","Besson","Dorfstr. 75","8248","Uhwiesen","CH","Männlich","1979-04-05","Aktiv-A G50m","A","LizenzG50m",null,null,null,null,8]
["1.44.0.00.013","Schaffhausen Sportschützen Munot","1204665","256591","Thomas","Biber","Im Dorf 7A","8241","Barzheim","CH","Männlich","1963-01-09","Aktiv-A G50m","A","LizenzG50m",null,null,null,null,8]
["1.44.0.00.013","Schaffhausen Sportschützen Munot","1055880","107794","Markus","Brühlmann","Dachsenerstr. 24","8248","Uhwiesen","CH","Männlich","1970-12-29","Aktiv-A G50m","A","LizenzG50m",null,null,null,null,8]
["1.44.0.00.013","Schaffhausen Sportschützen Munot","1259721","311649","Céline","Depeder","Schützengasse 17","8224","Löhningen","CH","Weiblich","1993-02-01","Aktiv-A G50m","A","LizenzG50m",null,null,null,null,8]
["1.44.0.00.013","Schaffhausen Sportschützen Munot","1903471","984207","Reinhold","Flad","Chlenglerweg 98c","8240","Thayngen","CH","Männlich","1969-01-07","Aktiv-A G50m","A","LizenzG50m",null,null,null,null,8]
["1.44.0.00.013","Schaffhausen Sportschützen Munot","1066499","118414","Ernst","Freimüller","Im Gispert 16","8457","Humlikon","CH","Männlich","1964-01-11","Aktiv-A G50m","A","LizenzG50m",null,null,null,null,8]
["1.44.0.00.013","Schaffhausen Sportschützen Munot","2266774","29429","Richard","Kaimov","Im Eschengut 12","8200","Schaffhausen","CH","Männlich","2010-02-28","Aktiv-A G50m","A","LizenzG50m",null,null,null,null,8]
["1.44.0.00.013","Schaffhausen Sportschützen Munot","1044353","21118","Isabella","Mussolin","Wirbelwies 10","8200","Schaffhausen","CH","Männlich","2008-01-23","Aktiv-A G50m","A","LizenzG50m",null,null,null,null,8]
["1.44.0.00.013","Schaffhausen Sportschützen Munot","2266773","29427","Timur","Nuray","Bocksrietstrasse 66","8200","Schaffhausen","CH","Männlich","2012-11-22","Aktiv-A G50m","A","LizenzG50m",null,null,null,null,8]
["1.44.0.00.013","Schaffhausen Sportschützen Munot","1032598","9282","Eduard","Scherer","Hofwiesenstr. 8","8450","Andelfingen","CH","Männlich","2006-12-13","Aktiv-A G50m","A","LizenzG50m",null,null,null,null,8]
["1.44.0.00.013","Schaffhausen Sportschützen Munot","1055539","107453","Roger","Schnetzler","Chilchgasse 1","8214","Gächlingen","CH","Männlich","1976-09-05","Aktiv-A G50m","A","LizenzG50m",null,null,null,null,8]
["1.44.0.00.013","Schaffhausen Sportschützen Munot","1056118","108033","Fritz","Spaar","Hinterer Berghof 143","8216","Oberhallau","CH","Männlich","1970-11-30","Aktiv-A G50m","A","LizenzG50m",null,null,null,null,8]
["1.44.0.00.013","Schaffhausen Sportschützen Munot","1044357","21122","Julien Jay","Studer","Wistenstr. 14","8240","Thayngen","CH","Männlich","2010-04-09","Aktiv-A G50m","A","LizenzG50m",null,null,null,null,8]
["1.44.0.00.013","Schaffhausen Sportschützen Munot","1322612","374544","Andreas","Studer","Wistenstr. 14","8240","Thayngen","CH","Männlich","1981-10-03","Aktiv-A G50m","A","LizenzG50m",null,null,null,null,8]
["1.44.0.00.013","Schaffhausen Sportschützen Munot","2382030","51799","Samuel","Tim","Föhrenstrasse 2","8200","Schaffhausen","CH","Männlich","2000-12-09","Aktiv-A G50m","A","LizenzG50m",null,null,null,null,8]
["1.44.0.00.013","Schaffhausen Sportschützen Munot","2384913","52297","Florian","Uhlig","","8200","Schaffhausen","CH","Männlich","2012-07-06","Aktiv-A G50m","A","LizenzG50m",null,null,null,null,8]
["1.44.0.00.013","Schaffhausen Sportschützen Munot","1526674","585601","Svenja","Wehle","Rittergutstr. 23","8200","Schaffhausen","CH","Weiblich","2001-11-01","Aktiv-A G50m","A","LizenzG50m",null,null,null,null,8]
["1.44.0.00.013","Schaffhausen Sportschützen Munot","1078015","129931","Rolf","Zollinger","Hauengasse 19","8215","Hallau","CH","Männlich","1959-11-29","Aktiv-A G50m","A","LizenzG50m",null,null,null,null,8]
["1.44.0.00.014","Neunforn Sportschützen","2310896","35372","Valentin","Gisler","Hauptstrasse 33","8524","Buch b. Frauenfeld","CH","Männlich","1999-07-09","Aktiv-A G50m","A","LizenzG50m",null,null,null,null,8]
["1.44.0.00.014","Neunforn Sportschützen","1063057","114972","Max","Keller","Wellhauserweg 31 A","8500","Frauenfeld","CH","Männlich","1945-09-10","Aktiv-A G50m","A","LizenzG50m",null,null,null,null,8]
["1.44.0.00.014","Neunforn Sportschützen","1097141","149058","Beat","Roth","Säntisstr. 41c","8523","Hagenbuch ZH","CH","Männlich","1952-07-30","Aktiv-A G50m","A","LizenzG50m",null,null,null,null,8]
["1.44.0.00.014","Neunforn Sportschützen","1051923","103837","René","Schmid","Im Eggli 3","8525","Niederneunforn","CH","Männlich","1945-06-20","Aktiv-A G50m","A","LizenzG50m",null,null,null,null,8]
["1.44.0.00.025","Lengwil Sportschützen","1199921","251847","Josef","Brand","Bahnhofstr. 6","8574","Lengwil","CH","Männlich","1939-02-14","Aktiv-A G50m","A","LizenzG50m",null,null,null,null,8]
["1.44.0.00.025","Lengwil Sportschützen","1061139","113054","Martin","Brüllmann","Schlösslistr. 4","8574","Lengwil","CH","Männlich","1978-10-25","Aktiv-A G50m","A","LizenzG50m",null,null,null,null,8]
["1.44.0.00.025","Lengwil Sportschützen","1061144","113059","Marco","Gerardi","Dettighoferstr. 2","8574","Lengwil","CH","Männlich","1984-08-17","Aktiv-A G50m","A","LizenzG50m",null,null,null,null,8]
["1.44.0.00.025","Lengwil Sportschützen","1061150","113065","Erika","Künzler","Bildstr. 5","9523","Züberwangen","CH","Weiblich","1968-10-25","Aktiv-A G50m","A","LizenzG50m",null,null,null,null,8]
["1.44.0.00.025","Lengwil Sportschützen","2196953","2348","Wolfgang","Lackner","Seestrasse 26","8597","Landschlacht","CH","Männlich","1970-01-03","Aktiv-A G50m","A","LizenzG50m",null,null,null,null,8]
["1.44.0.00.025","Lengwil Sportschützen","1683565","750732","Pavel","Müller","Hölzlistrasse 20a","8580","Amriswil","CH","Männlich","1997-08-14","Aktiv-A G50m","A","LizenzG50m",null,null,null,null,8]
["1.44.0.00.025","Lengwil Sportschützen","1849581","927879","Hans-Jörg","Saner","Seestr. 24","8597","Landschlacht TG","CH","Männlich","1967-03-07","Aktiv-A G50m","A","LizenzG50m",null,null,null,null,8]
["1.44.0.00.025","Lengwil Sportschützen","1868796","948059","Curdin","Schenkel","Kirchstr. 7","8595","Altnau","CH","Männlich","1965-01-23","Aktiv-A G50m","A","LizenzG50m",null,null,null,null,8]
["1.44.0.00.025","Lengwil Sportschützen","1868797","948060","Alice","Schenkel","Kirchstr. 7","8595","Altnau","CH","Weiblich","1965-04-26","Aktiv-A G50m","A","LizenzG50m",null,null,null,null,8]
["1.44.0.00.025","Lengwil Sportschützen","1276710","328640","Roman","Seiz","Birkenweg 4","8586","Andwil","CH","Männlich","1992-04-28","Aktiv-A G50m","A","LizenzG50m",null,null,null,null,8]
["1.44.0.00.025","Lengwil Sportschützen","1408025","459961","Marco","Spengler","Hofstrasse 5","8574","Illighausen","CH","Männlich","1993-05-19","Aktiv-A G50m","A","LizenzG50m",null,null,null,null,8]
["1.44.0.00.025","Lengwil Sportschützen","1061159","113074","Martin","Tschannen","Hauptstr. 12B","8585","Birwinken","CH","Männlich","1977-01-25","Aktiv-A G50m","A","LizenzG50m",null,null,null,null,8]
["1.44.0.00.034","Schönenbaumgarten Sportschützen","1158069","209994","Dieter","Derrer","Sonnenbergstr.9","8594","Güttingen","CH","Männlich","1951-01-08","Aktiv-A G50m","A","LizenzG50m",null,null,null,null,8]
["1.44.0.00.034","Schönenbaumgarten Sportschützen","1061287","113202","Elisabeth","Hemminger","Rutishausen 8","8585","Langrickenbach","CH","Weiblich","1947-10-03","Aktiv-A G50m","A","LizenzG50m",null,null,null,null,8]
["1.44.0.00.034","Schönenbaumgarten Sportschützen","1061293","113208","Fritz","Reinhard","Bergackerstr. 3","8585","Zuben","CH","Männlich","1947-04-20","Aktiv-A G50m","A","LizenzG50m",null,null,null,null,8]
["1.44.0.00.034","Schönenbaumgarten Sportschützen","1146600","198521","Karl","Reinhart","Eggethof 100","8585","Langrickenbach","CH","Männlich","1952-10-24","Aktiv-A G50m","A","LizenzG50m",null,null,null,null,8]
["1.44.0.00.034","Schönenbaumgarten Sportschützen","1061302","113217","Fritz","Soltermann","Lengwilerstr. 22","8585","Schönenbaumgarten","CH","Männlich","1961-01-15","Aktiv-A G50m","A","LizenzG50m",null,null,null,null,8]
["1.44.0.00.034","Schönenbaumgarten Sportschützen","1061308","113223","Josef","Stachel","Gerbestr. 20","8595","Altnau","CH","Männlich","1948-07-12","Aktiv-A G50m","A","LizenzG50m",null,null,null,null,8]
["1.44.0.00.034","Schönenbaumgarten Sportschützen","1061309","113224","Peter","Stacher","Seewies 25","8594","Güttingen","CH","Männlich","1973-10-02","Aktiv-A G50m","A","LizenzG50m",null,null,null,null,8]
["1.44.0.00.034","Schönenbaumgarten Sportschützen","1061313","113228","Hansueli","Zingg","Waldhof 21","8585","Langrickenbach","CH","Männlich","1955-05-29","Aktiv-A G50m","A","LizenzG50m",null,null,null,null,8]
[null,null,null,null,null,null,null,null,null,null,null,null,null,{"$f":"COUNTIF($M2:$M609,\"*G10m*\")","v":0},{"$f":"COUNTIF($M2:$M609,\"*G50m*\")","v":608},null,null,null,null,"8"]

{"sheet":"Alterskategorie","index":2,"n_rows":110,"n_cols":6,"rows_kept":110,"cut":false,"hidden":true,"merged":[[6,2,6,4],[11,2,11,4],[10,3,10,4],[8,3,8,4]]}
["Alter","Kategorie","Hatswil Sportschützen",null,null,"OVWS 2024"]
[1,"-","VLM 2026"]
[2,"-","Benz Rudolf",null,null,"Gouveia Lourenzo          2004"]
[3,"-","Stellg. aufgl."]
[4,"-","Anz. Probe: __",null,null,"Kreuzlingen         22.05.2024"]
[5,"-"]
[6,"-"]
[8,"U10"]
[9,"U10"]
[10,"U15"]
[11,"U15"]
[12,"U15"]
[13,"U15"]
[14,"U15"]
[15,"U17"]
[16,"U17"]
[17,"U19"]
[18,"U19"]
[19,"U21"]
[20,"U21"]
[21,"E"]
[22,"E"]
[23,"E"]
[24,"E"]
[25,"E"]
[26,"E"]
[27,"E"]
[28,"E"]
[29,"E"]
[30,"E"]
[31,"E"]
[32,"E"]
[33,"E"]
[34,"E"]
[35,"E"]
[36,"E"]
[37,"E"]
[38,"E"]
[39,"E"]
[40,"E"]
[41,"E"]
[42,"E"]
[43,"E"]
[44,"E"]
[45,"E"]
[46,"S"]
[47,"S"]
[48,"S"]
[49,"S"]
[50,"S"]
[51,"S"]
[52,"S"]
[53,"S"]
[54,"S"]
[55,"S"]
[56,"S"]
[57,"S"]
[58,"S"]
[59,"S"]
[60,"V"]
[61,"V"]
[62,"V"]
[63,"V"]
[64,"V"]
[65,"V"]
[66,"V"]
[67,"V"]
[68,"V"]
[69,"V"]
[70,"SV"]
[71,"SV"]
[72,"SV"]
[73,"SV"]
[74,"SV"]
[75,"SV"]
[76,"SV"]
[77,"SV"]
[78,"SV"]
[79,"SV"]
[80,"SV"]
[81,"SV"]
[82,"SV"]
[83,"SV"]
[84,"SV"]
[85,"SV"]
[86,"SV"]
[87,"SV"]
[88,"SV"]
[89,"SV"]
[90,"SV"]
[91,"SV"]
[92,"SV"]
[93,"SV"]
[94,"SV"]
[95,"SV"]
[96,"SV"]
[97,"SV"]
[98,"SV"]
[99,"SV"]
[100,"SV"]
[101,"SV"]
[102,"SV"]
[103,"SV"]
[104,"SV"]
[105,"SV"]
[106,"SV"]
[107,"SV"]
[108,"SV"]
[109,"SV"]
["F","XX"]

{"sheet":"LabelPrint","index":3,"n_rows":5,"n_cols":2,"rows_kept":5,"cut":false,"hidden":true,"merged":[[0,0,0,1],[1,0,1,1],[4,0,4,1]]}
["SVWS 2026"]
["Dettighofen Sportschützen"]
["Schmied Roger",1978]
["113390","Stellg. frei"]
["2 x E10 Schuss A10"]

{"sheet":"Konfiguration","index":4,"n_rows":11,"n_cols":27,"rows_kept":11,"cut":false,"hidden":true,"merged":[]}
["Etiketten Druck","Nein",null,null,null,null,null,null,null,null,null,null,null,null,null,null,null,null,null,null,null,null,null,null,"HP Color LaserJet Pro MFP M277 PCL 6","HP Color LaserJet Pro MFP M277 PCL 6 auf Ne05:","Ja"]
["Drucker",null,null,null,null,null,null,null,null,null,null,null,null,null,null,null,null,null,null,null,null,null,null,null,"Snagit 2020","Snagit 2020 auf Ne01:","Nein"]
[null,null,null,null,null,null,null,null,null,null,null,null,null,null,null,null,null,null,null,null,null,null,null,null,"SANEI BL112II","SANEI BL112II auf Ne02:"]
[null,null,null,null,null,null,null,null,null,null,null,null,null,null,null,null,null,null,null,null,null,null,null,null,"ZDesigner ZD420-203dpi ZPL","ZDesigner ZD420-203dpi ZPL auf Ne00:"]
[null,null,null,null,null,null,null,null,null,null,null,null,null,null,null,null,null,null,null,null,null,null,null,null,"Microsoft XPS Document Writer","Microsoft XPS Document Writer auf Ne03:"]
[null,null,null,null,null,null,null,null,null,null,null,null,null,null,null,null,null,null,null,null,null,null,null,null,"Microsoft Print to PDF","Microsoft Print to PDF auf Ne04:"]
[null,null,null,null,null,null,null,null,null,null,null,null,null,null,null,null,null,null,null,null,null,null,null,null,"Fax","Fax auf Ne06:"]
[null,null,null,null,null,null,null,null,null,null,null,null,null,null,null,null,null,null,null,null,null,null,null,null,"Brother HL-L2370DN series Printer","Brother HL-L2370DN series Printer auf Ne08:"]
[null,null,null,null,null,null,null,null,null,null,null,null,null,null,null,null,null,null,null,null,null,null,null,null,"OneNote (Desktop) - Protected","OneNote (Desktop) - Protected auf Ne03:"]
[null,null,null,null,null,null,null,null,null,null,null,null,null,null,null,null,null,null,null,null,null,null,null,null,"Brother QL-800","Brother QL-800 auf Ne07:"]
[null,null,null,null,null,null,null,null,null,null,null,null,null,null,null,null,null,null,null,null,null,null,null,null,"OneNote (Desktop)","OneNote (Desktop) auf nul:"]

{"sheet":"Version","index":5,"n_rows":2,"n_cols":2,"rows_kept":2,"cut":false,"hidden":false,"merged":[]}
["Stand:","2026-07-26"]
["Freigabe für:","SVWS 2026"]

{"sheet":"Anleitung","index":6,"n_rows":40,"n_cols":2,"rows_kept":40,"cut":false,"hidden":false,"merged":[]}
["Kurzanleitung:"]
[]
["-Ordner OVM auf Desktop oder in einen Ordner legen. Excel Datei OVM_.xlsm öffnen."]
["-Makros aktivieren."]
["Foto 1",{"$error":"#VALUE!"}]
["-Feld neben Kreis anklicken und Kreis aus Liste wählen. Foto 2"]
["Foto 2",{"$error":"#VALUE!"}]
["-Feld unter OVM Anlass anklicken und Anlass auswählen."]
["  Wenn SVWS angewählt wird blendet sich die SVWS Tabelle automatisch ein."]
["  Wenn VLM angewählt wird blendet sich automatisch eine 3. Passe ein."]
["Foto 3",{"$error":"#VALUE!"}]
["-Feld bei Vereinsnamen anklicken Dropdown und dann Verein aus Liste wählen. Foto 4"]
["Foto 4",{"$error":"#VALUE!"}]
["-Die Resultate können für den jeweiligen Schützen in Spalte P1 P2 und bei VLM in P3 eingetragen werden."]
["  Auszeichnung wird automatisch generiert. Die Resultate werden eingespeichert und hinterlegt."]
["  Ein Wechsel der Vereine ist jederzeit ohne Datenverlust möglich.  "]
["-Knopf Resultate sortieren sortiert die Ergebnisse des aktuellen Vereins. Wenn SVWS angewählt"]
["  Blendet sich Fenster in Tabelle SVWS eintragen ein, Daten werden nach Tabelle SVWSS kopiert. Foto 5/Foto 6"]
["  Wenn die Resultate sortiert sind, werden in der oberen Bildhälfte die Gruppenresultate eingeblendet. Foto 7"]
["Foto 5",{"$error":"#VALUE!"}]
["Foto 6",{"$error":"#VALUE!"}]
["Foto 7",{"$error":"#VALUE!"}]
["-Tabelle Rangliste, beim Öffnen werden alle Schützen des Schiesskreises die geschossen haben automatisch "]
["  Eingetragen und sortiert. Ebenfalls die Gruppen Resultate. Foto 8"]
["Foto 8",{"$error":"#VALUE!"}]
["-Alle Blätter haben rechts oben ein Druckersymbol als Knopf. Bei Betätigung wird das jeweils aktive Blatt als"]
["  PDF Datei in den jeweiligen Ordner abgelegt. Foto 9"]
["Foto 9",{"$error":"#VALUE!"}]
["-Beim ersten Mal kann es sein, dass 2 mal eine Berechtigungsanfrage eingeblendet wird, diese müssen "]
["  bestätigt, respektive ausgewählt werden. Foto 10"]
["Foto 10",{"$error":"#VALUE!"}]
["-zusätzliche Schützen erfassen: Knopf Teilnehmer hinzufügen Foto 11"]
["Foto 11",{"$error":"#VALUE!"}]
[" Fenster Schützen Daten erfassen öffnet sich. Daten eingeben und Knopf neuen Schützen speichern drücken."]
[" Foto12. ",{"$error":"#VALUE!"}]
[" Tabelle OVM wird automatisch aktualisiert."]
[]
["Anmerkung:"]
["Die Excel Datei läuft sowohl unter Windows als auch unter OS für Mac."]
["Es werden nur Schützen eingelesen, die in der ausgeblendeten Tabelle SSV_Lizenz_Auswertung auch erfasst sind."]

{"sheet":"OVM","index":7,"n_rows":115,"n_cols":32,"rows_kept":115,"cut":false,"hidden":false,"merged":[[35,24,35,26],[48,24,48,26],[1,10,3,11],[13,2,13,4],[13,9,13,13],[20,12,20,13],[16,12,16,13],[18,12,18,13],[19,12,19,13],[22,24,22,26],[17,12,17,13],[7,9,7,13],[9,0,9,1],[9,2,9,4],[9,9,9,13],[7,0,7,1],[15,0,15,1],[15,12,15,13],[10,0,10,1],[10,2,10,4],[10,9,10,13],[11,2,11,4],[11,9,11,13],[12,2,12,4],[12,9,12,13]]}
[]
[null,null,null,null,null,null,null,null,null,null,2026]
[]
[]
[]
[null,null,null,null,null,null,null,null,null,"Kreis:",7,null,"50m"]
["OVM Anlass"]
["SVWS",null,{"$f":"IF(A8=\"VLM\",3,IF(A8<>\"VLM\",2,2))","v":2},null,null,null,"Vereinsname:",null,null,"Dettighofen Sportschützen",null,null,null,null,null,{"$f":"IFERROR(LOOKUP($J$8,OVM!AF24:AF48,OVM!AD24:AD48),0)","v":13},44,null,"männlich"]
[null,null,null,null,null,null,null,null,null,{"$f":"IF(J8=\"\",\"\",INDEX(SSV_Organisation!$A$3:$A$46,MATCH($J$8&$M$6&$K$6,SSV_Organisation!$B$3:$B$46&SSV_Organisation!$E$3:$E$46&SSV_Organisation!$C$3:$C$46,0)))","v":"1.44.0.00.010"},null,null,null,null,null,null,null,null,"weiblich"]
["Korrespondenz Adresse:",null,"Name, Vorname:",null,null,null,null,null,null,"Mäder Thomas"]
[null,null,"Strasse:",null,null,null,null,null,null,"Ifangweg 4"]
[null,null,"PLZ, Ort:",null,null,null,null,null,null,"8508 Homburg"]
[null,null,"Tel:",null,null,null,null,null,null,"052 765 27 75"]
[null,null,"E-Mail:",null,null,null,null,null,null,"thomas_maeder@bluewin.ch"]
[null,null,null,null,null,null,null,null,null,null,null,null,null,null,null,null,{"$f":"IF(Q16=\"\",0,SUM(Q16:Q21))","v":0}]
["Lizenzierte Mitglieder :",null,null,{"$f":"COUNTIF(W24:W65,\"A\") + COUNTIFS(W24:W65,\"B\",I24:I65,\">0\")","v":33},null,{"$f":"IF($M$20/6>0.5,\"Gruppe1\",\"\")","v":""},{"$f":"IF(F16<>\"\",SUM(I24:I29),\"\")","v":""},null,null,null,{"$f":"IF($A$8=\"SVWS\",\"Vereinsresultat\",\"\")","v":"Vereinsresultat"},null,{"$f":"IF(A$8=\"SVWS\",ROUND((K66+L67)/D17,3),\"\")","v":0},null,null,null,{"$f":"IF($M$20/6>0.5,1,\"\")","v":""},{"$f":"IF($M$20/6>0.5,1,\"\")","v":""},{"$f":"IFERROR(IF(LOOKUP($J$8,SSV_Organisation[Vereinsname],SSV_Organisation[Grp.Dpp.])=\"\",0,LOOKUP($J$8,SSV_Organisation[Vereinsname],SSV_Organisation[Grp.Dpp.])),\"\")","v":0},{"$f":"ROUNDDOWN($M$20/6,0)","v":0}]
[{"$f":"IF($A$8=\"SVWS\",\"Pflichtresultate :\",\"Mannschaften :\")","v":"Pflichtresultate :"},null,null,{"$f":"IF($A$8=\"SVWS\",IF(D16<10,6,ROUND(0.7*D16,0)),ROUNDDOWN(M20/6,0))","v":23},null,{"$f":"IF($M$20/6>1.5,\"Gruppe2\",\"\")","v":""},{"$f":"IF(F17<>\"\",SUM(I30:I35),\"\")","v":""},null,null,null,null,null,null,null,null,null,{"$f":"IF($M$20/6>1.5,1,\"\")","v":""},{"$f":"IF($M$20/6>1.5,2,\"\")","v":""},null,{"$f":"IF(ROUNDDOWN($M$20/6,0)=2,ROUNDDOWN($M$20/6,0),\"\")","v":""}]
["Teilnehmer :",null,"E / S",{"$f":"COUNTIF($Q$24:$Q$65,\"E\")+COUNTIF($Q$24:$Q$65,\"S\")","v":15},null,{"$f":"IF($M$20/6>2.5,\"Gruppe3\",\"\")","v":""},{"$f":"IF(F18<>\"\",SUM(I36:I41),\"\")","v":""},null,null,null,"Kranzkarten",null,{"$f":"COUNT(M24:M65)","v":0},null,null,null,{"$f":"IF($M$20/6>2.5,1,\"\")","v":""},{"$f":"IF($M$20/6>2.51,3,\"\")","v":""},null,{"$f":"IF(ROUNDDOWN($M$20/6,0)=3,ROUNDDOWN($M$20/6,0),\"\")","v":""}]
[null,null,"U10-U21",{"$f":"COUNTIF($Q$24:$Q$65,\"U10\")+COUNTIF($Q$24:$Q$65,\"U15\")+COUNTIF($Q$24:$Q$65,\"U17\")++COUNTIF($Q$24:$Q$65,\"U19\")++COUNTIF($Q$24:$Q$65,\"U21\")","v":6},null,{"$f":"IF($M$20/6>3.5,\"Gruppe4\",\"\")","v":""},{"$f":"IF(F19<>\"\",SUM(I42:I47),\"\")","v":""},null,null,null,{"$f":"IF($A$8=\"SVWS\",\"Sportschützenkarten\",\"\")","v":"Sportschützenkarten"},null,{"$f":"IF($A$8=\"SVWS\",COUNT(N24:N65),\"\")","v":0},null,null,null,{"$f":"IF($M$20/6>3.5,1,\"\")","v":""},{"$f":"IF($M$20/6>3.5,4,\"\")","v":""},null,{"$f":"IF(ROUNDDOWN($M$20/6,0)=4,ROUNDDOWN($M$20/6,0),\"\")","v":""}]
[null,null,"V / SV",{"$f":"COUNTIF($Q$24:$Q$65,\"V\")+COUNTIF($Q$24:$Q$65,\"SV\")","v":13},null,{"$f":"IF($M$20/6>4.5,\"Gruppe5\",\"\")","v":""},{"$f":"IF(F20<>\"\",SUM(I48:I53),\"\")","v":""},null,null,null,"Total Teilnehmer",null,{"$f":"COUNTIF(I24:I65,\">0\")","v":0},null,null,null,{"$f":"IF($M$20/6>4.5,1,\"\")","v":""},{"$f":"IF($M$20/6>4.5,5,\"\")","v":""},null,{"$f":"IF(ROUNDDOWN($M$20/6,0)=5,ROUNDDOWN($M$20/6,0),\"\")","v":""}]
[null,null,null,null,null,{"$f":"IF($M$20/6>5.5,\"Gruppe-\",\"\")","v":""},{"$f":"IF(F21<>\"\",SUM(I54:I59),\"\")","v":""},null,null,null,"Beteiligung",null,{"$f":"M20/D16","v":0},null,null,null,{"$f":"IF($M$20/6>5.5,1,\"\")","v":""},{"$f":"IF($M$20/6>5.5,6,\"\")","v":""},null,{"$f":"IF(ROUNDDOWN($M$20/6,0)=6,ROUNDDOWN($M$20/6,0),\"\")","v":""},null,null,null,"Auszeichnungen"]
[null,null,null,null,null,null,null,null,null,null,null,null,null,null,0]
["Nr.","Name","Vorname","Geb.","Stellg.","1. \nPasse","2. \nPasse","3. \nPasse",null,"Alters-stufe","Pflicht-\nResultat",{"$f":"IF($A$8=\"SVWS\",\"Streich- Resultat\",\"\")","v":"Streich- Resultat"},"Kranz-\nKarte","SPS-\nKarte",null,"Alter","Alterskat.","Rang1","AnzGleich","Rang Kor.",null,"Kranz-SOLL","LizKat",null,"Stellg.",null,null,"LizNr","Stellg.",null,"Kreis","Verein suchen"]
[1,"Barth","Hardy",1934,null,null,null,null,{"$f":"IF($A$8=\"VLM\",IF(ISBLANK(Q24),\"\",SUM(F24:H24)),IF(ISBLANK(Q24),\"\",SUM(F24:G24)))","v":0},{"$f":"IF(ISBLANK(P24),\"\",Q24)","v":"SV"},{"$f":"IF($A$8=\"SVWS\",IF($T24<=$D$17,$I24,\"\"),$I24)","v":0},{"$f":"IF($A$8=\"SVWS\",IF(ISBLANK($I24),\"\",IF($T24>$D$17,$I24,\"\")),\"\")","v":""},{"$f":"IF(E24=\"\",\"\",IF(I24>=V24,1,\"\"))","v":""},{"$f":"IF(E24=\"\",\"\",IF(I24>=V24,1,\"\"))","v":""},497,{"$f":"IF(ISBLANK(D24),\"\",$K$2-D24)","v":92},{"$f":"IF(P24<>\"\",(LOOKUP(P24,Alterskategorie!$A$2:$A$110,Alterskategorie!$B$2:$B$110)),\"\")","v":"SV"},{"$f":"IF(ISBLANK(I24),\"\",RANK(I24,I$24:I$65,0))","v":1},{"$f":"IF(ISBLANK(I24),\"\",COUNTIF(R$24:R24,R24)-1)","v":0},{"$f":"IF(ISBLANK(I24),\"\",R24+S24)","v":1},0,{"$f":"IF(D24<\"\",VLOOKUP(J24,$X$25:$AA$34,MATCH(E24,$X$24:$AA$24,)),\"\")","v":{"$error":"#N/A"}},"A",null,"frei","aufgl.","XX","112726","frei",7,1,"Bazenheid Sportschützen"]
[{"$f":"IF(B25>\"\",A24+1,\"\")","v":2},"Barth","Roman",1971,null,null,null,null,0,"S",0,"","","",498,55,{"$f":"IF(P25<>\"\",(LOOKUP(P25,Alterskategorie!$A$2:$A$110,Alterskategorie!$B$2:$B$110)),\"\")","v":"S"},1,{"$f":"IF(ISBLANK(I25),\"\",COUNTIF(R$24:R25,R25)-1)","v":1},2,0,{"$error":"#N/A"},"A","E",{"$f":"IF($A$8=\"OVWS\",Y38,IF($A$8=\"VLM\",Y51,IF($A$8=\"SVWS\",Y64,\"????\")))","v":180},"ung.","ung.","112727","aufgl.",13,2,"Dettighofen Sportschützen"]
[{"$f":"IF(B26>\"\",A25+1,\"\")","v":3},"Damann","Levin",2011,null,null,null,null,0,"U17",0,"","","",499,15,{"$f":"IF(P26<>\"\",(LOOKUP(P26,Alterskategorie!$A$2:$A$110,Alterskategorie!$B$2:$B$110)),\"\")","v":"U17"},1,{"$f":"IF(ISBLANK(I26),\"\",COUNTIF(R$24:R26,R26)-1)","v":2},3,0,{"$error":"#N/A"},"A","S",{"$f":"IF($A$8=\"OVWS\",Y39,IF($A$8=\"VLM\",Y52,IF($A$8=\"SVWS\",Y65,\"????\")))","v":180},"ung.","ung.","30665","XX",18,3,"Frauenfeld Stadtschützen Gesellschaft"]
[4,"Fröhlich","Jda",1952,null,null,null,null,0,"SV",0,"","","",500,74,{"$f":"IF(P27<>\"\",(LOOKUP(P27,Alterskategorie!$A$2:$A$110,Alterskategorie!$B$2:$B$110)),\"\")","v":"SV"},1,{"$f":"IF(ISBLANK(I27),\"\",COUNTIF(R$24:R27,R27)-1)","v":3},4,0,{"$error":"#N/A"},"A","SV",172,{"$f":"IF($A$8=\"OVWS\",Z40,IF($A$8=\"VLM\",Z53,IF($A$8=\"SVWS\",Z66,\"????\")))","v":176},"ung.","20462","XX",27,4,"Märwil Schützenverein"]
[5,"Fröhlich","Stephan",1978,null,null,null,null,0,"S",0,"","","",501,48,{"$f":"IF(P28<>\"\",(LOOKUP(P28,Alterskategorie!$A$2:$A$110,Alterskategorie!$B$2:$B$110)),\"\")","v":"S"},1,{"$f":"IF(ISBLANK(I28),\"\",COUNTIF(R$24:R28,R28)-1)","v":4},5,0,{"$error":"#N/A"},"A","U13",172,176,"ung.","112738",null,41,5,"Wängi Sportschützen"]
[6,"Fröhlich","Roland",1952,null,null,null,null,0,"SV",0,"","","",502,74,{"$f":"IF(P29<>\"\",(LOOKUP(P29,Alterskategorie!$A$2:$A$110,Alterskategorie!$B$2:$B$110)),\"\")","v":"SV"},1,{"$f":"IF(ISBLANK(I29),\"\",COUNTIF(R$24:R29,R29)-1)","v":5},6,0,{"$error":"#N/A"},"A","U15",172,176,"ung.","112737",null,42,6,"Weinfelden Schützengesellschaft"]
[7,"Fuster  (B)","Urs",1953,null,null,null,null,0,"SV",0,"","","",503,73,{"$f":"IF(P30<>\"\",(LOOKUP(P30,Alterskategorie!$A$2:$A$110,Alterskategorie!$B$2:$B$110)),\"\")","v":"SV"},1,{"$f":"IF(ISBLANK(I30),\"\",COUNTIF(R$24:R30,R30)-1)","v":6},7,0,{"$error":"#N/A"},"B","U17",172,"ung.","ung.","113396",null,44,7,"Wil SG Stadtschützen"]
[8,"Gantenbein","Claudia",1976,null,null,null,null,0,"S",0,"","","",504,50,{"$f":"IF(P31<>\"\",(LOOKUP(P31,Alterskategorie!$A$2:$A$110,Alterskategorie!$B$2:$B$110)),\"\")","v":"S"},1,{"$f":"IF(ISBLANK(I31),\"\",COUNTIF(R$24:R31,R31)-1)","v":7},8,0,{"$error":"#N/A"},"A","U19",176,"ung.","ung.","278152",null,null,8]
[9,"Ganz","Nelly",1948,null,null,null,null,0,"SV",0,"","","",505,78,{"$f":"IF(P32<>\"\",(LOOKUP(P32,Alterskategorie!$A$2:$A$110,Alterskategorie!$B$2:$B$110)),\"\")","v":"SV"},1,{"$f":"IF(ISBLANK(I32),\"\",COUNTIF(R$24:R32,R32)-1)","v":8},9,0,{"$error":"#N/A"},"A","U21",176,"ung.","ung.","163217"]
[10,"Greutmann","Kay",2010,null,null,null,null,0,"U17",0,"","","",506,16,{"$f":"IF(P33<>\"\",(LOOKUP(P33,Alterskategorie!$A$2:$A$110,Alterskategorie!$B$2:$B$110)),\"\")","v":"U17"},1,{"$f":"IF(ISBLANK(I33),\"\",COUNTIF(R$24:R33,R33)-1)","v":9},10,0,{"$error":"#N/A"},"A","V",176,"ung.","ung.","29063"]
[11,"Hagen","Linn",2009,null,null,null,null,0,"U19",0,"","","",507,17,{"$f":"IF(P34<>\"\",(LOOKUP(P34,Alterskategorie!$A$2:$A$110,Alterskategorie!$B$2:$B$110)),\"\")","v":"U19"},1,{"$f":"IF(ISBLANK(I34),\"\",COUNTIF(R$24:R34,R34)-1)","v":10},11,0,{"$error":"#N/A"},"A","xx","ung.","ung.","ung.","15910"]
[12,"Hagen","Roland",1965,null,null,null,null,0,"V",0,"","","",508,61,{"$f":"IF(P35<>\"\",(LOOKUP(P35,Alterskategorie!$A$2:$A$110,Alterskategorie!$B$2:$B$110)),\"\")","v":"V"},1,{"$f":"IF(ISBLANK(I35),\"\",COUNTIF(R$24:R35,R35)-1)","v":11},12,0,{"$error":"#N/A"},"A",null,null,null,null,"9221"]
[13,"Kaufmann","Armin",1954,null,null,null,null,0,"SV",0,"","","",509,72,{"$f":"IF(P36<>\"\",(LOOKUP(P36,Alterskategorie!$A$2:$A$110,Alterskategorie!$B$2:$B$110)),\"\")","v":"SV"},1,{"$f":"IF(ISBLANK(I36),\"\",COUNTIF(R$24:R36,R36)-1)","v":12},13,0,{"$error":"#N/A"},"A","ovws","Stellg.",null,null,"113444","OVWS"]
[14,"Kutter","Joel Leon",2010,null,null,null,null,0,"U17",0,"","","",510,16,{"$f":"IF(P37<>\"\",(LOOKUP(P37,Alterskategorie!$A$2:$A$110,Alterskategorie!$B$2:$B$110)),\"\")","v":"U17"},1,{"$f":"IF(ISBLANK(I37),\"\",COUNTIF(R$24:R37,R37)-1)","v":13},14,0,{"$error":"#N/A"},"A",null,"frei","aufgl.","XX","2504","VLM"]
[15,"Kübler","Nadja",1995,null,null,null,null,0,"E",0,"","","",511,31,{"$f":"IF(P38<>\"\",(LOOKUP(P38,Alterskategorie!$A$2:$A$110,Alterskategorie!$B$2:$B$110)),\"\")","v":"E"},1,{"$f":"IF(ISBLANK(I38),\"\",COUNTIF(R$24:R38,R38)-1)","v":14},15,0,{"$error":"#N/A"},"A","E",175,"ung.","ung.","291732","SVWS"]
[16,"Kühne","Fridolin",1958,null,null,null,null,0,"V",0,"","","",512,68,{"$f":"IF(P39<>\"\",(LOOKUP(P39,Alterskategorie!$A$2:$A$110,Alterskategorie!$B$2:$B$110)),\"\")","v":"V"},1,{"$f":"IF(ISBLANK(I39),\"\",COUNTIF(R$24:R39,R39)-1)","v":15},16,0,{"$error":"#N/A"},"A","S",175,"ung.","ung.","118178"]
[17,"Lang","Hansjörg",1948,null,null,null,null,0,"SV",0,"","","",513,78,{"$f":"IF(P40<>\"\",(LOOKUP(P40,Alterskategorie!$A$2:$A$110,Alterskategorie!$B$2:$B$110)),\"\")","v":"SV"},1,{"$f":"IF(ISBLANK(I40),\"\",COUNTIF(R$24:R40,R40)-1)","v":16},17,0,{"$error":"#N/A"},"A","SV",167,171,"ung.","112752"]
[18,"Meier","Marco",1973,null,null,null,null,0,"S",0,"","","",514,53,{"$f":"IF(P41<>\"\",(LOOKUP(P41,Alterskategorie!$A$2:$A$110,Alterskategorie!$B$2:$B$110)),\"\")","v":"S"},1,{"$f":"IF(ISBLANK(I41),\"\",COUNTIF(R$24:R41,R41)-1)","v":17},18,0,{"$error":"#N/A"},"A","U13",167,171,"ung.","166094"]
[19,"Meier","Julia",1976,null,null,null,null,0,"S",0,"","","",515,50,{"$f":"IF(P42<>\"\",(LOOKUP(P42,Alterskategorie!$A$2:$A$110,Alterskategorie!$B$2:$B$110)),\"\")","v":"S"},1,{"$f":"IF(ISBLANK(I42),\"\",COUNTIF(R$24:R42,R42)-1)","v":18},19,0,{"$error":"#N/A"},"A","U15",167,171,"ung.","746282"]
[20,"Meili","Fabian",1991,null,null,null,null,0,"E",0,"","","",516,35,{"$f":"IF(P43<>\"\",(LOOKUP(P43,Alterskategorie!$A$2:$A$110,Alterskategorie!$B$2:$B$110)),\"\")","v":"E"},1,{"$f":"IF(ISBLANK(I43),\"\",COUNTIF(R$24:R43,R43)-1)","v":19},20,0,{"$error":"#N/A"},"A","U17",167,"ung.","ung.","259589"]
[21,"Meili","Bernhard",1950,null,null,null,null,0,"SV",0,"","","",517,76,{"$f":"IF(P44<>\"\",(LOOKUP(P44,Alterskategorie!$A$2:$A$110,Alterskategorie!$B$2:$B$110)),\"\")","v":"SV"},1,{"$f":"IF(ISBLANK(I44),\"\",COUNTIF(R$24:R44,R44)-1)","v":20},21,0,{"$error":"#N/A"},"A","U19",171,"ung.","ung.","148061"]
[22,"Miesen","Sophia",2010,null,null,null,null,0,"U17",0,"","","",518,16,{"$f":"IF(P45<>\"\",(LOOKUP(P45,Alterskategorie!$A$2:$A$110,Alterskategorie!$B$2:$B$110)),\"\")","v":"U17"},1,{"$f":"IF(ISBLANK(I45),\"\",COUNTIF(R$24:R45,R45)-1)","v":21},22,0,{"$error":"#N/A"},"A","U21",171,"ung.","ung.","31526"]
[23,"Mäder","Jan",2002,null,null,null,null,0,"E",0,"","","",519,24,{"$f":"IF(P46<>\"\",(LOOKUP(P46,Alterskategorie!$A$2:$A$110,Alterskategorie!$B$2:$B$110)),\"\")","v":"E"},1,{"$f":"IF(ISBLANK(I46),\"\",COUNTIF(R$24:R46,R46)-1)","v":22},23,0,{"$error":"#N/A"},"A","V",171,"ung.","ung.","754279"]
[24,"Mäder","Thomas",1975,null,null,null,null,0,"S","",0,"","",520,51,{"$f":"IF(P47<>\"\",(LOOKUP(P47,Alterskategorie!$A$2:$A$110,Alterskategorie!$B$2:$B$110)),\"\")","v":"S"},1,{"$f":"IF(ISBLANK(I47),\"\",COUNTIF(R$24:R47,R47)-1)","v":23},24,0,{"$error":"#N/A"},"A","xx","ung.","ung.","ung.","314267"]
[25,"Perren","Pascal",1988,null,null,null,null,0,"E","",0,"","",521,38,{"$f":"IF(P48<>\"\",(LOOKUP(P48,Alterskategorie!$A$2:$A$110,Alterskategorie!$B$2:$B$110)),\"\")","v":"E"},1,{"$f":"IF(ISBLANK(I48),\"\",COUNTIF(R$24:R48,R48)-1)","v":24},25,0,{"$error":"#N/A"},"A",null,null,null,null,"312359"]
[26,"Peter","Mischa",1976,null,null,null,null,0,"S","",0,"","",522,50,{"$f":"IF(P49<>\"\",(LOOKUP(P49,Alterskategorie!$A$2:$A$110,Alterskategorie!$B$2:$B$110)),\"\")","v":"S"},1,{"$f":"IF(ISBLANK(I49),\"\",COUNTIF(R$24:R49,R49)-1)","v":25},26,0,{"$error":"#N/A"},"A","VLM","Stellg.",null,null,"129981"]
[27,"Rosenkranz","Christoff",1959,null,null,null,null,0,"V","",0,"","",523,67,{"$f":"IF(P50<>\"\",(LOOKUP(P50,Alterskategorie!$A$2:$A$110,Alterskategorie!$B$2:$B$110)),\"\")","v":"V"},1,{"$f":"IF(ISBLANK(I50),\"\",COUNTIF(R$24:R50,R50)-1)","v":26},27,0,{"$error":"#N/A"},"A",null,"frei","aufgl.","XX","328987"]
[28,"Salathé","Marcel",1963,null,null,null,null,0,"V","",0,"","",524,63,{"$f":"IF(P51<>\"\",(LOOKUP(P51,Alterskategorie!$A$2:$A$110,Alterskategorie!$B$2:$B$110)),\"\")","v":"V"},1,{"$f":"IF(ISBLANK(I51),\"\",COUNTIF(R$24:R51,R51)-1)","v":27},28,0,{"$error":"#N/A"},"A","E",263,"ung.","ung.","9223"]
[29,"Salzmann","Ruedi",1961,null,null,null,null,0,"V","",0,"","",525,65,{"$f":"IF(P52<>\"\",(LOOKUP(P52,Alterskategorie!$A$2:$A$110,Alterskategorie!$B$2:$B$110)),\"\")","v":"V"},1,{"$f":"IF(ISBLANK(I52),\"\",COUNTIF(R$24:R52,R52)-1)","v":28},29,0,{"$error":"#N/A"},"A","S",263,"ung.","ung.","398312"]
[30,"Schmied","Roger",1978,null,null,null,null,0,"S","",0,"","",526,48,{"$f":"IF(P53<>\"\",(LOOKUP(P53,Alterskategorie!$A$2:$A$110,Alterskategorie!$B$2:$B$110)),\"\")","v":"S"},1,{"$f":"IF(ISBLANK(I53),\"\",COUNTIF(R$24:R53,R53)-1)","v":29},30,0,{"$error":"#N/A"},"A","SV",251,257,"ung.","113390"]
[31,"Spuhler","Beatrix",1967,null,null,null,null,0,"S","",0,"","",527,59,{"$f":"IF(P54<>\"\",(LOOKUP(P54,Alterskategorie!$A$2:$A$110,Alterskategorie!$B$2:$B$110)),\"\")","v":"S"},1,{"$f":"IF(ISBLANK(I54),\"\",COUNTIF(R$24:R54,R54)-1)","v":30},31,0,{"$error":"#N/A"},"A","U13",251,257,"ung.","227063"]
[32,"Waldvogel","Mike",1988,null,null,null,null,0,"E","",0,"","",528,38,{"$f":"IF(P55<>\"\",(LOOKUP(P55,Alterskategorie!$A$2:$A$110,Alterskategorie!$B$2:$B$110)),\"\")","v":"E"},1,{"$f":"IF(ISBLANK(I55),\"\",COUNTIF(R$24:R55,R55)-1)","v":31},32,0,{"$error":"#N/A"},"A","U15",251,257,"ung.","387336"]
[33,"Wettstein","Oliver",2003,null,null,null,null,0,"E","",0,"","",529,23,{"$f":"IF(P56<>\"\",(LOOKUP(P56,Alterskategorie!$A$2:$A$110,Alterskategorie!$B$2:$B$110)),\"\")","v":"E"},1,{"$f":"IF(ISBLANK(I56),\"\",COUNTIF(R$24:R56,R56)-1)","v":32},33,0,{"$error":"#N/A"},"A","U17",251,"ung.","ung.","850496"]
[34,"Zulauf","Manuel",2010,null,null,null,null,0,"U17","",0,"","",530,16,{"$f":"IF(P57<>\"\",(LOOKUP(P57,Alterskategorie!$A$2:$A$110,Alterskategorie!$B$2:$B$110)),\"\")","v":"U17"},1,{"$f":"IF(ISBLANK(I57),\"\",COUNTIF(R$24:R57,R57)-1)","v":33},34,0,{"$error":"#N/A"},"A","U19",257,"ung.","ung.","42418"]
["",null,null,null,null,null,null,null,0,"","",0,"","",null,"",{"$f":"IF(P58<>\"\",(LOOKUP(P58,Alterskategorie!$A$2:$A$110,Alterskategorie!$B$2:$B$110)),\"\")","v":""},1,{"$f":"IF(ISBLANK(I58),\"\",COUNTIF(R$24:R58,R58)-1)","v":34},35,0,"",null,"U21",257,"ung.","ung."]
["",null,null,null,null,null,null,null,0,"","",0,"","",null,"",{"$f":"IF(P59<>\"\",(LOOKUP(P59,Alterskategorie!$A$2:$A$110,Alterskategorie!$B$2:$B$110)),\"\")","v":""},1,{"$f":"IF(ISBLANK(I59),\"\",COUNTIF(R$24:R59,R59)-1)","v":35},36,0,"",null,"V",251,"ung.","ung."]
["",null,null,null,null,null,null,null,0,"","",0,"","",null,"",{"$f":"IF(P60<>\"\",(LOOKUP(P60,Alterskategorie!$A$2:$A$110,Alterskategorie!$B$2:$B$110)),\"\")","v":""},1,{"$f":"IF(ISBLANK(I60),\"\",COUNTIF(R$24:R60,R60)-1)","v":36},37,0,"",null,"xx","ung.","ung.","ung."]
["",null,null,null,null,null,null,null,0,"","",0,"","",null,"",{"$f":"IF(P61<>\"\",(LOOKUP(P61,Alterskategorie!$A$2:$A$110,Alterskategorie!$B$2:$B$110)),\"\")","v":""},1,{"$f":"IF(ISBLANK(I61),\"\",COUNTIF(R$24:R61,R61)-1)","v":37},38,0,""]
["",null,null,null,null,null,null,null,0,"","",0,"","",null,"",{"$f":"IF(P62<>\"\",(LOOKUP(P62,Alterskategorie!$A$2:$A$110,Alterskategorie!$B$2:$B$110)),\"\")","v":""},1,{"$f":"IF(ISBLANK(I62),\"\",COUNTIF(R$24:R62,R62)-1)","v":38},39,0,"",null,"SVWS",null,null,"Stellg."]
["",null,null,null,null,null,null,null,0,"","",0,"","",null,"",{"$f":"IF(P63<>\"\",(LOOKUP(P63,Alterskategorie!$A$2:$A$110,Alterskategorie!$B$2:$B$110)),\"\")","v":""},1,{"$f":"IF(ISBLANK(I63),\"\",COUNTIF(R$24:R63,R63)-1)","v":39},40,0,"",null,null,"LG-F","LG-A","XX"]
["",null,null,null,null,null,null,null,0,"","",0,"","",null,"",{"$f":"IF(P64<>\"\",(LOOKUP(P64,Alterskategorie!$A$2:$A$110,Alterskategorie!$B$2:$B$110)),\"\")","v":""},1,{"$f":"IF(ISBLANK(I64),\"\",COUNTIF(R$24:R64,R64)-1)","v":40},41,0,"",null,"E",180,"ung.","ung."]
["",null,null,null,null,null,null,null,0,"","",0,"","",null,"",{"$f":"IF(P65<>\"\",(LOOKUP(P65,Alterskategorie!$A$2:$A$110,Alterskategorie!$B$2:$B$110)),\"\")","v":""},1,{"$f":"IF(ISBLANK(I65),\"\",COUNTIF(R$24:R65,R65)-1)","v":41},42,0,"",null,"S",180,"ung.","ung."]
[null,null,null,null,"Total Pflicht / Nichtpflicht",null,null,null,null,null,{"$f":"SUM(K24:K65)","v":0},{"$f":"SUM(L24:L65)","v":0},null,null,null,null,null,null,null,null,null,null,null,"SV",172,176,"ung."]
[null,null,null,null,"3% vom Streichresultat",null,null,null,null,null,null,{"$f":"ROUNDDOWN((L66*3%),2)","v":0},null,null,null,null,null,null,null,null,null,null,null,"U13",172,176,"ung."]
[null,null,null,null,null,null,null,null,null,null,null,null,null,null,null,null,null,null,null,null,null,null,null,"U15",172,176,"ung."]
[null,null,"*= ohne Lizenz ",null,null,null,null,null,null,null,null,null,null,null,null,null,null,null,null,null,null,null,null,"U17",172,"ung.","ung."]
[null,null,null,null,null,null,null,null,null,null,null,null,null,null,null,null,null,null,null,null,null,null,null,"U19",176,"ung.","ung."]
[null,null,null,null,null,null,null,null,null,null,null,null,null,null,null,null,null,null,null,null,null,null,null,"U21",176,"ung.","ung."]
[null,null,null,null,null,null,null,null,null,null,null,null,null,null,null,null,null,null,null,null,null,null,null,"V",176,"ung.","ung."]
[null,null,null,null,null,null,null,null,null,null,null,null,null,null,null,null,null,null,null,null,null,null,null,"xx","ung.","ung.","ung."]
[]
[]
[]
[]
[]
[]
[]
[]
[]
[]
[]
[]
[]
[]
[]
[]
[]
[]
[]
[]
[]
[]
[]
[]
[]
[]
[]
[]
[]
[]
[]
[]
[]
[]
[]
[]
[]
[]
[]
[]
[null,null,null,"1 ✓",null,null,1]
[null,null,null,"Alterskat. ",null,null,"AnzGleich"]

{"sheet":"SVWS","index":8,"n_rows":67,"n_cols":29,"rows_kept":67,"cut":false,"hidden":false,"merged":[[8,2,8,4],[8,9,8,13],[5,0,5,13],[6,3,6,4],[6,9,6,13],[7,2,7,4],[7,9,7,13],[9,0,9,1],[9,2,9,4],[9,9,9,13],[10,0,10,1],[10,2,10,4],[10,9,10,13],[17,9,17,11],[17,12,17,13],[11,2,11,4],[11,9,11,13],[12,2,12,4],[12,9,12,13],[13,2,13,4],[13,9,13,13],[15,0,15,1],[15,9,15,11],[15,12,15,13],[16,9,16,11],[16,12,16,13],[22,23,22,26],[65,4,65,9],[66,4,66,9],[18,9,18,11],[18,12,18,13],[19,9,19,11],[19,12,19,13],[20,9,20,11],[20,12,20,13]]}
[null,null,"SCHWEIZER SCHIESSSPORTVERBAND",null,null,null,null,null,null,null,"Rolf Binz"]
[null,null,"FÉDÉRATION SPORTIVE SUISSE DE TIR",null,null,null,null,null,null,null,"Huntelweg 8"]
[null,null,"FEDERAZIONE SPORTIVA SVIZZERA DI TIRO",null,null,null,null,null,null,null,"4586 Buchegg"]
[null,null,null,null,null,null,null,null,null,null,"032 661 17 09"]
[null,null,"V2023_11",null,null,null,null,null,null,null,"binz-wirth@gawnet.ch"]
["__________________________________________________________________________________________________"]
["Vereinswettschiessen",null,null,{"$f":"OVM!$K$2","v":2026},null,null,null,null,null,"Gewehr 50 Meter"]
["Verein:",null,"Vereinsname:",null,null,null,null,null,null,{"$f":"OVM!J8","v":"Dettighofen Sportschützen"}]
[null,null,"Vereinsnummer:",null,null,null,null,null,null,{"$f":"OVM!J9","v":"1.44.0.00.010"}]
["Korrespondenz Adresse:",null,"Name, Vorname:",null,null,null,null,null,null,"?"]
[null,null,"Strasse:",null,null,null,null,null,null,"?"]
[null,null,"PLZ, Ort:",null,null,null,null,null,null,"?"]
[null,null,"Tel:",null,null,null,null,null,null,"?"]
[null,null,"E-Mail:",null,null,null,null,null,null,"?"]
[]
["Lizenzierte Mitglieder :",null,null,{"$f":"OVM!$D$16","v":33},null,null,null,null,null,"Vereinsresultat",null,null,{"$f":"ROUND((K66+L67)/D17,3)","v":49.564999999999998}]
["Pflichtresultate :",null,null,{"$f":"IF(D16<10,6,ROUND(0.7*D16,0))","v":23}]
["Teilnehmer :",null,"E / S",{"$f":"COUNTIF($Q$24:$Q$65,\"E\")+COUNTIF($Q$24:$Q$65,\"S\")","v":2},null,null,null,null,null,"Kranzkarten",null,null,{"$f":"COUNT(N24:N65)","v":6}]
[null,null,"U10-U21",{"$f":"COUNTIF($Q$24:$Q$65,\"U10\")+COUNTIF($Q$24:$Q$65,\"U15\")+COUNTIF($Q$24:$Q$65,\"U17\")++COUNTIF($Q$24:$Q$65,\"U19\")++COUNTIF($Q$24:$Q$65,\"U21\")","v":1},null,null,null,null,null,"Sportschützenkarten",null,null,{"$f":"COUNT(M24:M65)","v":6}]
[null,null,"V / SV",{"$f":"COUNTIF($Q$24:$Q$65,\"V\")+COUNTIF($Q$24:$Q$65,\"SV\")","v":3},null,null,null,null,null,"Total Teilnehmer",null,null,{"$f":"COUNTIF(I24:I65,\">0\")","v":6}]
[null,null,null,null,null,null,null,null,null,"Beteiligung",null,null,{"$f":"M20/D16","v":0.18181818181818182}]
[]
["Nr.","Name","Vorname","Jg.","Stlg.","P1","P2",null,"Total","Alters-stufe","Pflicht-\nResultat","Streich-\nResultat","SPS-\nKarte","Kranz-\nKarte",null,"Alter","Alterskat.","Rang1","AnzGleich","Rang Kor.",null,"Kranz-SOLL",null,"Auszeichnungslimiten",null,null,null,null,"Stellg."]
[1,"Barth","Hardy",1934,"aufgl.",95,95,null,{"$f":"IF(ISBLANK(Q24),\"\",SUM(F24:G24))","v":190},{"$f":"IF(ISBLANK(P24),\"\",Q24)","v":"SV"},{"$f":"IF(T24<=$D$17,I24,\"\")","v":190},{"$f":"IF(ISBLANK(I24),\"\",IF(T24>D$17,I24,\"\"))","v":""},{"$f":"N24","v":1},{"$f":"IF(I24=\"\",\"\",IF(I24>=V24,1,\"\"))","v":1},null,{"$f":"IF(ISBLANK(D24),\"\",$D$7-D24)","v":92},{"$f":"IF(P24<>\"\",(LOOKUP(P24,Alterskategorie!$A$2:$A$110,Alterskategorie!$B$2:$B$110)),\"\")","v":"SV"},{"$f":"IF(ISBLANK(I24),\"\",RANK(I24,I$24:I$65,0))","v":1},{"$f":"IF(ISBLANK(I24),\"\",COUNTIF(R$24:R24,R24)-1)","v":0},{"$f":"IF(ISBLANK(I24),\"\",R24+S24)","v":1},null,{"$f":"IF(D24<\"\",VLOOKUP(J24,$X$25:$AA$34,MATCH(E24,$X$24:$AA$24,)),\"\")","v":176},null,null,"frei","aufgl.","XX",null,"frei"]
[{"$f":"IF(B25>\"\",A24+1,\"\")","v":2},"Fröhlich","Jda",1952,"aufgl.",95,95,null,{"$f":"IF(ISBLANK(Q25),\"\",SUM(F25:G25))","v":190},"SV",190,"",{"$f":"N25","v":1},{"$f":"IF(I25=\"\",\"\",IF(I25>=V25,1,\"\"))","v":1},null,74,{"$f":"IF(P25<>\"\",(LOOKUP(P25,Alterskategorie!$A$2:$A$110,Alterskategorie!$B$2:$B$110)),\"\")","v":"SV"},1,{"$f":"IF(ISBLANK(I25),\"\",COUNTIF(R$24:R25,R25)-1)","v":1},2,null,176,null,"E",180,"ung.","ung.",null,"aufgl."]
[{"$f":"IF(B26>\"\",A25+1,\"\")","v":3},"Fröhlich","Roland",1952,"frei",95,95,null,190,"SV",190,"",1,1,null,74,{"$f":"IF(P26<>\"\",(LOOKUP(P26,Alterskategorie!$A$2:$A$110,Alterskategorie!$B$2:$B$110)),\"\")","v":"SV"},1,{"$f":"IF(ISBLANK(I26),\"\",COUNTIF(R$24:R26,R26)-1)","v":2},3,null,172,null,"S",180,"ung.","ung.",null,"XX"]
[4,"Barth","Roman",1971,"frei",95,95,null,190,"S",190,"",1,1,null,55,{"$f":"IF(P27<>\"\",(LOOKUP(P27,Alterskategorie!$A$2:$A$110,Alterskategorie!$B$2:$B$110)),\"\")","v":"S"},1,{"$f":"IF(ISBLANK(I27),\"\",COUNTIF(R$24:R27,R27)-1)","v":3},4,null,180,null,"SV",172,176,"ung.",null,"XX"]
[5,"Fröhlich","Stephan",1978,"frei",95,95,null,190,"S",190,"",1,1,null,48,{"$f":"IF(P28<>\"\",(LOOKUP(P28,Alterskategorie!$A$2:$A$110,Alterskategorie!$B$2:$B$110)),\"\")","v":"S"},1,{"$f":"IF(ISBLANK(I28),\"\",COUNTIF(R$24:R28,R28)-1)","v":4},5,null,180,null,"U13",172,176,"ung."]
[6,"Damann","Levin",2011,"frei",95,95,null,190,"U17",190,"",1,1,null,15,{"$f":"IF(P29<>\"\",(LOOKUP(P29,Alterskategorie!$A$2:$A$110,Alterskategorie!$B$2:$B$110)),\"\")","v":"U17"},1,{"$f":"IF(ISBLANK(I29),\"\",COUNTIF(R$24:R29,R29)-1)","v":5},6,null,172,null,"U15",172,176,"ung."]
["",null,null,null,null,null,null,null,0,"",0,"","","",null,"",{"$f":"IF(P30<>\"\",(LOOKUP(P30,Alterskategorie!$A$2:$A$110,Alterskategorie!$B$2:$B$110)),\"\")","v":""},7,{"$f":"IF(ISBLANK(I30),\"\",COUNTIF(R$24:R30,R30)-1)","v":0},7,null,"",null,"U17",172,"ung.","ung."]
["",null,null,null,null,null,null,null,0,"",0,"","","",null,"",{"$f":"IF(P31<>\"\",(LOOKUP(P31,Alterskategorie!$A$2:$A$110,Alterskategorie!$B$2:$B$110)),\"\")","v":""},7,{"$f":"IF(ISBLANK(I31),\"\",COUNTIF(R$24:R31,R31)-1)","v":1},8,null,"",null,"U19",176,"ung.","ung."]
["",null,null,null,null,null,null,null,0,"",0,"","","",null,"",{"$f":"IF(P32<>\"\",(LOOKUP(P32,Alterskategorie!$A$2:$A$110,Alterskategorie!$B$2:$B$110)),\"\")","v":""},7,{"$f":"IF(ISBLANK(I32),\"\",COUNTIF(R$24:R32,R32)-1)","v":2},9,null,"",null,"U21",176,"ung.","ung."]
["",null,null,null,null,null,null,null,0,"",0,"","","",null,"",{"$f":"IF(P33<>\"\",(LOOKUP(P33,Alterskategorie!$A$2:$A$110,Alterskategorie!$B$2:$B$110)),\"\")","v":""},7,{"$f":"IF(ISBLANK(I33),\"\",COUNTIF(R$24:R33,R33)-1)","v":3},10,null,"",null,"V",176,"ung.","ung."]
["",null,null,null,null,null,null,null,0,"",0,"","","",null,"",{"$f":"IF(P34<>\"\",(LOOKUP(P34,Alterskategorie!$A$2:$A$110,Alterskategorie!$B$2:$B$110)),\"\")","v":""},7,{"$f":"IF(ISBLANK(I34),\"\",COUNTIF(R$24:R34,R34)-1)","v":4},11,null,"",null,"xx","ung.","ung.","ung."]
["",null,null,null,null,null,null,null,0,"",0,"","","",null,"",{"$f":"IF(P35<>\"\",(LOOKUP(P35,Alterskategorie!$A$2:$A$110,Alterskategorie!$B$2:$B$110)),\"\")","v":""},7,{"$f":"IF(ISBLANK(I35),\"\",COUNTIF(R$24:R35,R35)-1)","v":5},12,null,""]
["",null,null,null,null,null,null,null,0,"",0,"","","",null,"",{"$f":"IF(P36<>\"\",(LOOKUP(P36,Alterskategorie!$A$2:$A$110,Alterskategorie!$B$2:$B$110)),\"\")","v":""},7,{"$f":"IF(ISBLANK(I36),\"\",COUNTIF(R$24:R36,R36)-1)","v":6},13,null,""]
["",null,null,null,null,null,null,null,0,"",0,"","","",null,"",{"$f":"IF(P37<>\"\",(LOOKUP(P37,Alterskategorie!$A$2:$A$110,Alterskategorie!$B$2:$B$110)),\"\")","v":""},7,{"$f":"IF(ISBLANK(I37),\"\",COUNTIF(R$24:R37,R37)-1)","v":7},14,null,""]
["",null,null,null,null,null,null,null,0,"",0,"","","",null,"",{"$f":"IF(P38<>\"\",(LOOKUP(P38,Alterskategorie!$A$2:$A$110,Alterskategorie!$B$2:$B$110)),\"\")","v":""},7,{"$f":"IF(ISBLANK(I38),\"\",COUNTIF(R$24:R38,R38)-1)","v":8},15,null,""]
["",null,null,null,null,null,null,null,0,"",0,"","","",null,"",{"$f":"IF(P39<>\"\",(LOOKUP(P39,Alterskategorie!$A$2:$A$110,Alterskategorie!$B$2:$B$110)),\"\")","v":""},7,{"$f":"IF(ISBLANK(I39),\"\",COUNTIF(R$24:R39,R39)-1)","v":9},16,null,""]
["",null,null,null,null,null,null,null,0,"",0,"","","",null,"",{"$f":"IF(P40<>\"\",(LOOKUP(P40,Alterskategorie!$A$2:$A$110,Alterskategorie!$B$2:$B$110)),\"\")","v":""},7,{"$f":"IF(ISBLANK(I40),\"\",COUNTIF(R$24:R40,R40)-1)","v":10},17,null,""]
["",null,null,null,null,null,null,null,0,"",0,"","","",null,"",{"$f":"IF(P41<>\"\",(LOOKUP(P41,Alterskategorie!$A$2:$A$110,Alterskategorie!$B$2:$B$110)),\"\")","v":""},7,{"$f":"IF(ISBLANK(I41),\"\",COUNTIF(R$24:R41,R41)-1)","v":11},18,null,""]
["",null,null,null,null,null,null,null,0,"",0,"","","",null,"",{"$f":"IF(P42<>\"\",(LOOKUP(P42,Alterskategorie!$A$2:$A$110,Alterskategorie!$B$2:$B$110)),\"\")","v":""},7,{"$f":"IF(ISBLANK(I42),\"\",COUNTIF(R$24:R42,R42)-1)","v":12},19,null,""]
["",null,null,null,null,null,null,null,0,"",0,"","","",null,"",{"$f":"IF(P43<>\"\",(LOOKUP(P43,Alterskategorie!$A$2:$A$110,Alterskategorie!$B$2:$B$110)),\"\")","v":""},7,{"$f":"IF(ISBLANK(I43),\"\",COUNTIF(R$24:R43,R43)-1)","v":13},20,null,""]
["",null,null,null,null,null,null,null,0,"",0,"","","",null,"",{"$f":"IF(P44<>\"\",(LOOKUP(P44,Alterskategorie!$A$2:$A$110,Alterskategorie!$B$2:$B$110)),\"\")","v":""},7,{"$f":"IF(ISBLANK(I44),\"\",COUNTIF(R$24:R44,R44)-1)","v":14},21,null,""]
["",null,null,null,null,null,null,null,0,"",0,"","","",null,"",{"$f":"IF(P45<>\"\",(LOOKUP(P45,Alterskategorie!$A$2:$A$110,Alterskategorie!$B$2:$B$110)),\"\")","v":""},7,{"$f":"IF(ISBLANK(I45),\"\",COUNTIF(R$24:R45,R45)-1)","v":15},22,null,""]
["",null,null,null,null,null,null,null,0,"",0,"","","",null,"",{"$f":"IF(P46<>\"\",(LOOKUP(P46,Alterskategorie!$A$2:$A$110,Alterskategorie!$B$2:$B$110)),\"\")","v":""},7,{"$f":"IF(ISBLANK(I46),\"\",COUNTIF(R$24:R46,R46)-1)","v":16},23,null,""]
["",null,null,null,null,null,null,null,0,"","",0,"","",null,"",{"$f":"IF(P47<>\"\",(LOOKUP(P47,Alterskategorie!$A$2:$A$110,Alterskategorie!$B$2:$B$110)),\"\")","v":""},7,{"$f":"IF(ISBLANK(I47),\"\",COUNTIF(R$24:R47,R47)-1)","v":17},24,null,""]
["",null,null,null,null,null,null,null,0,"","",0,"","",null,"",{"$f":"IF(P48<>\"\",(LOOKUP(P48,Alterskategorie!$A$2:$A$110,Alterskategorie!$B$2:$B$110)),\"\")","v":""},7,{"$f":"IF(ISBLANK(I48),\"\",COUNTIF(R$24:R48,R48)-1)","v":18},25,null,""]
["",null,null,null,null,null,null,null,0,"","",0,"","",null,"",{"$f":"IF(P49<>\"\",(LOOKUP(P49,Alterskategorie!$A$2:$A$110,Alterskategorie!$B$2:$B$110)),\"\")","v":""},7,{"$f":"IF(ISBLANK(I49),\"\",COUNTIF(R$24:R49,R49)-1)","v":19},26,null,""]
["",null,null,null,null,null,null,null,0,"","",0,"","",null,"",{"$f":"IF(P50<>\"\",(LOOKUP(P50,Alterskategorie!$A$2:$A$110,Alterskategorie!$B$2:$B$110)),\"\")","v":""},7,{"$f":"IF(ISBLANK(I50),\"\",COUNTIF(R$24:R50,R50)-1)","v":20},27,null,""]
["",null,null,null,null,null,null,null,0,"","",0,"","",null,"",{"$f":"IF(P51<>\"\",(LOOKUP(P51,Alterskategorie!$A$2:$A$110,Alterskategorie!$B$2:$B$110)),\"\")","v":""},7,{"$f":"IF(ISBLANK(I51),\"\",COUNTIF(R$24:R51,R51)-1)","v":21},28,null,""]
["",null,null,null,null,null,null,null,0,"","",0,"","",null,"",{"$f":"IF(P52<>\"\",(LOOKUP(P52,Alterskategorie!$A$2:$A$110,Alterskategorie!$B$2:$B$110)),\"\")","v":""},7,{"$f":"IF(ISBLANK(I52),\"\",COUNTIF(R$24:R52,R52)-1)","v":22},29,null,""]
["",null,null,null,null,null,null,null,0,"","",0,"","",null,"",{"$f":"IF(P53<>\"\",(LOOKUP(P53,Alterskategorie!$A$2:$A$110,Alterskategorie!$B$2:$B$110)),\"\")","v":""},7,{"$f":"IF(ISBLANK(I53),\"\",COUNTIF(R$24:R53,R53)-1)","v":23},30,null,""]
["",null,null,null,null,null,null,null,0,"","",0,"","",null,"",{"$f":"IF(P54<>\"\",(LOOKUP(P54,Alterskategorie!$A$2:$A$110,Alterskategorie!$B$2:$B$110)),\"\")","v":""},7,{"$f":"IF(ISBLANK(I54),\"\",COUNTIF(R$24:R54,R54)-1)","v":24},31,null,""]
["",null,null,null,null,null,null,null,0,"","",0,"","",null,"",{"$f":"IF(P55<>\"\",(LOOKUP(P55,Alterskategorie!$A$2:$A$110,Alterskategorie!$B$2:$B$110)),\"\")","v":""},7,{"$f":"IF(ISBLANK(I55),\"\",COUNTIF(R$24:R55,R55)-1)","v":25},32,null,""]
["",null,null,null,null,null,null,null,0,"","",0,"","",null,"",{"$f":"IF(P56<>\"\",(LOOKUP(P56,Alterskategorie!$A$2:$A$110,Alterskategorie!$B$2:$B$110)),\"\")","v":""},7,{"$f":"IF(ISBLANK(I56),\"\",COUNTIF(R$24:R56,R56)-1)","v":26},33,null,""]
["",null,null,null,null,null,null,null,0,"","",0,"","",null,"",{"$f":"IF(P57<>\"\",(LOOKUP(P57,Alterskategorie!$A$2:$A$110,Alterskategorie!$B$2:$B$110)),\"\")","v":""},7,{"$f":"IF(ISBLANK(I57),\"\",COUNTIF(R$24:R57,R57)-1)","v":27},34,null,""]
["",null,null,null,null,null,null,null,0,"","",0,"","",null,"",{"$f":"IF(P58<>\"\",(LOOKUP(P58,Alterskategorie!$A$2:$A$110,Alterskategorie!$B$2:$B$110)),\"\")","v":""},7,{"$f":"IF(ISBLANK(I58),\"\",COUNTIF(R$24:R58,R58)-1)","v":28},35,null,""]
["",null,null,null,null,null,null,null,0,"","",0,"","",null,"",{"$f":"IF(P59<>\"\",(LOOKUP(P59,Alterskategorie!$A$2:$A$110,Alterskategorie!$B$2:$B$110)),\"\")","v":""},7,{"$f":"IF(ISBLANK(I59),\"\",COUNTIF(R$24:R59,R59)-1)","v":29},36,null,""]
["",null,null,null,null,null,null,null,0,"","",0,"","",null,"",{"$f":"IF(P60<>\"\",(LOOKUP(P60,Alterskategorie!$A$2:$A$110,Alterskategorie!$B$2:$B$110)),\"\")","v":""},7,{"$f":"IF(ISBLANK(I60),\"\",COUNTIF(R$24:R60,R60)-1)","v":30},37,null,""]
["",null,null,null,null,null,null,null,0,"","",0,"","",null,"",{"$f":"IF(P61<>\"\",(LOOKUP(P61,Alterskategorie!$A$2:$A$110,Alterskategorie!$B$2:$B$110)),\"\")","v":""},7,{"$f":"IF(ISBLANK(I61),\"\",COUNTIF(R$24:R61,R61)-1)","v":31},38,null,""]
["",null,null,null,null,null,null,null,0,"","",0,"","",null,"",{"$f":"IF(P62<>\"\",(LOOKUP(P62,Alterskategorie!$A$2:$A$110,Alterskategorie!$B$2:$B$110)),\"\")","v":""},7,{"$f":"IF(ISBLANK(I62),\"\",COUNTIF(R$24:R62,R62)-1)","v":32},39,null,""]
["",null,null,null,null,null,null,null,0,"","",0,"","",null,"",{"$f":"IF(P63<>\"\",(LOOKUP(P63,Alterskategorie!$A$2:$A$110,Alterskategorie!$B$2:$B$110)),\"\")","v":""},7,{"$f":"IF(ISBLANK(I63),\"\",COUNTIF(R$24:R63,R63)-1)","v":33},40,null,""]
["",null,null,null,null,null,null,null,0,"","",0,"","",null,"",{"$f":"IF(P64<>\"\",(LOOKUP(P64,Alterskategorie!$A$2:$A$110,Alterskategorie!$B$2:$B$110)),\"\")","v":""},7,{"$f":"IF(ISBLANK(I64),\"\",COUNTIF(R$24:R64,R64)-1)","v":34},41,null,""]
["",null,null,null,null,null,null,null,0,"","",0,"","",null,"",{"$f":"IF(P65<>\"\",(LOOKUP(P65,Alterskategorie!$A$2:$A$110,Alterskategorie!$B$2:$B$110)),\"\")","v":""},7,{"$f":"IF(ISBLANK(I65),\"\",COUNTIF(R$24:R65,R65)-1)","v":35},42,null,""]
[null,null,null,null,"Total Pflicht / Nichtpflicht",null,null,null,null,null,{"$f":"SUM(K24:K65)","v":1140},{"$f":"SUM(L24:L65)","v":0}]
[null,null,null,null,"3% vom Streichresultat",null,null,null,null,null,null,{"$f":"ROUNDDOWN((L66*3%),2)","v":0}]

{"sheet":"Rangliste","index":9,"n_rows":134,"n_cols":21,"rows_kept":134,"cut":false,"hidden":false,"merged":[[2,3,2,8]]}
[null,null,null,null,null,null,null,null,null,""]
[]
[null,null,null,{"$f":"_xlfn.CONCAT(\"Rangliste \",OVM!$A$8,\" \",OVM!$K$2)","v":"Rangliste SVWS 2026"}]
[null,null,null,null,null,null,null,"E / S",{"$f":"COUNTIF($F$9:$F$108,\"E\")+COUNTIF($F$9:$F$108,\"S\")","v":0},{"$f":"IF(OVM!A8=\"VLM\",1800,1200)","v":1200}]
[null,{"$f":"_xlfn.CONCAT(\"Kreis \",OVM!$K$6)","v":"Kreis 7"},null,"Einzelrangliste",null,null,null,"U10-U21",{"$f":"COUNTIF($F$9:$F$108,\"U10\")+COUNTIF($F$9:$F$108,\"U15\")+COUNTIF($F$9:$F$108,\"U17\")+COUNTIF($F$9:$F$108,\"U19\")+COUNTIF($F$9:$F$108,\"U21\")","v":0},{"$f":"COUNTIF($F$9:$F$108,\"U10\")+COUNTIF($F$9:$F$108,\"U15\")+COUNTIF($F$9:$F$108,\"U17\")+COUNTIF($F$9:$F$108,\"U19\")+COUNTIF($F$9:$F$108,\"U21\")","v":0},null,null,null,"1905-07-16"]
[null,null,null,null,"KKarten:",{"$f":"SUM(L9:L108)","v":0},null,"V / SV",{"$f":"COUNTIF($F$9:$F$108,\"V\")+COUNTIF($F$9:$F$108,\"SV\")","v":0},{"$f":"COUNTIF($F$9:$F$108,\"V\")+COUNTIF($F$9:$F$108,\"SV\")","v":0}]
[null,null,null,null,null,null,null,null,1]
[null,"Name","Vorname","Verein","Jg","Kat.","Punkte","Kreis","Gruppe",null,null,"Karten","Mann.","Gruppe","Zeile SSV","Grp. Sort.","Verein",null,"Grp.","Alter","Kat."]
[1,null,null,null,null,{"$f":"IF(B9<>\"\",(LOOKUP(T9,Alterskategorie!$A$2:$A$110,Alterskategorie!$B$2:$B$110)),\"\")","v":""},null,null,null,{"$f":"IF(IF(P9=1,K9,IF(AND(K9<>0,D9=D8),J8+K9,0))>J$4,K9,IF(P9=1,K9,IF(AND(K9<>0,D9=D8),J8+K9,0)))","v":0},{"$f":"IF($P9<=M9*6,$G9,0)","v":0},null,{"$f":"IFERROR(LOOKUP($D9,SSV_Organisation[Vereinsname],SSV_Organisation[Grp.Dpp.]),0)","v":0},{"$f":"IF(AND(P9<7,M9>0),1,IF(AND(P9<13,M9>1),2,IF(AND(P9<19,M9>2),3,IF(AND(P9<25,M9>3),4,IF(AND(P9<31,M9>4),5,IF(AND(P9<37,M9>5),6,0))))))","v":0},497,1,{"$f":"IF(AND($M9>0,$D9<>$D10),D9,IF(OR($P9=6,$P9=12,$P9=18,$P9=24,$P9=30,$P9=36,$P9=42,$P9=48,$P9=54,$P9=60,$P9=66,$P9=72,$P9=78,$P9=84,$P9=90,$P9=96),$D9,\"\"))","v":""},{"$f":"IF(AND($M9>0,$D9<>$D10),$D9,\"\")","v":""},{"$f":"IF(Q9<>\"\",SUM(J9),\"\")","v":""},{"$f":"IF(ISBLANK(E9),\"\",$N$5-E9)","v":""},{"$f":"IF(T9<>\"\",(LOOKUP(T9,Alterskategorie!$A$2:$A$110,Alterskategorie!$B$2:$B$110)),\"\")","v":""}]
[{"$f":"IF(B10>\"\",A9+1,\"\")","v":""},null,null,null,null,{"$f":"IF(B10<>\"\",(LOOKUP(T10,Alterskategorie!$A$2:$A$110,Alterskategorie!$B$2:$B$110)),\"\")","v":""},null,null,null,{"$f":"IF(IF(P10=1,K10,IF(AND(K10<>0,D10=D9),J9+K10,0))>J$4,K10,IF(P10=1,K10,IF(AND(K10<>0,D10=D9),J9+K10,0)))","v":0},{"$f":"IF($P10<=M10*6,$G10,0)","v":0},null,{"$f":"IFERROR(LOOKUP($D10,SSV_Organisation[Vereinsname],SSV_Organisation[Grp.Dpp.]),0)","v":0},{"$f":"IF(AND(P10<7,M10>0),1,IF(AND(P10<13,M10>1),2,IF(AND(P10<19,M10>2),3,IF(AND(P10<25,M10>3),4,IF(AND(P10<31,M10>4),5,IF(AND(P10<37,M10>5),6,0))))))","v":0},500,{"$f":"IF(ISBLANK($D10),\"\",IF($D10=$D9,$P9+1,1))","v":""},{"$f":"IF(AND($M10>0,$D10<>$D11),D10,IF(OR($P10=6,$P10=12,$P10=18,$P10=24,$P10=30,$P10=36,$P10=42,$P10=48,$P10=54,$P10=60,$P10=66,$P10=72,$P10=78,$P10=84,$P10=90,$P10=96),$D10,\"\"))","v":""},{"$f":"IF(AND($M10>0,$D10<>$D11),$D10,\"\")","v":""},{"$f":"IF(Q10<>\"\",SUM(J10),\"\")","v":""},"",{"$f":"IF(T10<>\"\",(LOOKUP(T10,Alterskategorie!$A$2:$A$110,Alterskategorie!$B$2:$B$110)),\"\")","v":""}]
["",null,null,null,null,{"$f":"IF(B11<>\"\",(LOOKUP(T11,Alterskategorie!$A$2:$A$110,Alterskategorie!$B$2:$B$110)),\"\")","v":""},null,null,null,{"$f":"IF(IF(P11=1,K11,IF(AND(K11<>0,D11=D10),J10+K11,0))>J$4,K11,IF(P11=1,K11,IF(AND(K11<>0,D11=D10),J10+K11,0)))","v":0},{"$f":"IF($P11<=M11*6,$G11,0)","v":0},null,{"$f":"IFERROR(LOOKUP($D11,SSV_Organisation[Vereinsname],SSV_Organisation[Grp.Dpp.]),0)","v":0},{"$f":"IF(AND(P11<7,M11>0),1,IF(AND(P11<13,M11>1),2,IF(AND(P11<19,M11>2),3,IF(AND(P11<25,M11>3),4,IF(AND(P11<31,M11>4),5,IF(AND(P11<37,M11>5),6,0))))))","v":0},502,{"$f":"IF(ISBLANK($D11),\"\",IF($D11=$D10,$P10+1,1))","v":""},"",{"$f":"IF(AND($M11>0,$D11<>$D12),$D11,\"\")","v":""},"","",{"$f":"IF(T11<>\"\",(LOOKUP(T11,Alterskategorie!$A$2:$A$110,Alterskategorie!$B$2:$B$110)),\"\")","v":""}]
["",null,null,null,null,{"$f":"IF(B12<>\"\",(LOOKUP(T12,Alterskategorie!$A$2:$A$110,Alterskategorie!$B$2:$B$110)),\"\")","v":""},null,null,null,{"$f":"IF(IF(P12=1,K12,IF(AND(K12<>0,D12=D11),J11+K12,0))>J$4,K12,IF(P12=1,K12,IF(AND(K12<>0,D12=D11),J11+K12,0)))","v":0},{"$f":"IF($P12<=M12*6,$G12,0)","v":0},null,{"$f":"IFERROR(LOOKUP($D12,SSV_Organisation[Vereinsname],SSV_Organisation[Grp.Dpp.]),0)","v":0},{"$f":"IF(AND(P12<7,M12>0),1,IF(AND(P12<13,M12>1),2,IF(AND(P12<19,M12>2),3,IF(AND(P12<25,M12>3),4,IF(AND(P12<31,M12>4),5,IF(AND(P12<37,M12>5),6,0))))))","v":0},498,"","","","","",{"$f":"IF(T12<>\"\",(LOOKUP(T12,Alterskategorie!$A$2:$A$110,Alterskategorie!$B$2:$B$110)),\"\")","v":""}]
["",null,null,null,null,{"$f":"IF(B13<>\"\",(LOOKUP(T13,Alterskategorie!$A$2:$A$110,Alterskategorie!$B$2:$B$110)),\"\")","v":""},null,null,null,{"$f":"IF(IF(P13=1,K13,IF(AND(K13<>0,D13=D12),J12+K13,0))>J$4,K13,IF(P13=1,K13,IF(AND(K13<>0,D13=D12),J12+K13,0)))","v":0},{"$f":"IF($P13<=M13*6,$G13,0)","v":0},null,{"$f":"IFERROR(LOOKUP($D13,SSV_Organisation[Vereinsname],SSV_Organisation[Grp.Dpp.]),0)","v":0},{"$f":"IF(AND(P13<7,M13>0),1,IF(AND(P13<13,M13>1),2,IF(AND(P13<19,M13>2),3,IF(AND(P13<25,M13>3),4,IF(AND(P13<31,M13>4),5,IF(AND(P13<37,M13>5),6,0))))))","v":0},501,"","","","","",{"$f":"IF(T13<>\"\",(LOOKUP(T13,Alterskategorie!$A$2:$A$110,Alterskategorie!$B$2:$B$110)),\"\")","v":""}]
["",null,null,null,null,{"$f":"IF(B14<>\"\",(LOOKUP(T14,Alterskategorie!$A$2:$A$110,Alterskategorie!$B$2:$B$110)),\"\")","v":""},null,null,null,{"$f":"IF(IF(P14=1,K14,IF(AND(K14<>0,D14=D13),J13+K14,0))>J$4,K14,IF(P14=1,K14,IF(AND(K14<>0,D14=D13),J13+K14,0)))","v":0},{"$f":"IF($P14<=M14*6,$G14,0)","v":0},null,{"$f":"IFERROR(LOOKUP($D14,SSV_Organisation[Vereinsname],SSV_Organisation[Grp.Dpp.]),0)","v":0},{"$f":"IF(AND(P14<7,M14>0),1,IF(AND(P14<13,M14>1),2,IF(AND(P14<19,M14>2),3,IF(AND(P14<25,M14>3),4,IF(AND(P14<31,M14>4),5,IF(AND(P14<37,M14>5),6,0))))))","v":0},499,"","","","","",{"$f":"IF(T14<>\"\",(LOOKUP(T14,Alterskategorie!$A$2:$A$110,Alterskategorie!$B$2:$B$110)),\"\")","v":""}]
["",null,null,null,null,{"$f":"IF(B15<>\"\",(LOOKUP(T15,Alterskategorie!$A$2:$A$110,Alterskategorie!$B$2:$B$110)),\"\")","v":""},null,null,null,{"$f":"IF(IF(P15=1,K15,IF(AND(K15<>0,D15=D14),J14+K15,0))>J$4,K15,IF(P15=1,K15,IF(AND(K15<>0,D15=D14),J14+K15,0)))","v":0},{"$f":"IF($P15<=M15*6,$G15,0)","v":0},null,{"$f":"IFERROR(LOOKUP($D15,SSV_Organisation[Vereinsname],SSV_Organisation[Grp.Dpp.]),0)","v":0},{"$f":"IF(AND(P15<7,M15>0),1,IF(AND(P15<13,M15>1),2,IF(AND(P15<19,M15>2),3,IF(AND(P15<25,M15>3),4,IF(AND(P15<31,M15>4),5,IF(AND(P15<37,M15>5),6,0))))))","v":0},391,"","","","","",{"$f":"IF(T15<>\"\",(LOOKUP(T15,Alterskategorie!$A$2:$A$110,Alterskategorie!$B$2:$B$110)),\"\")","v":""}]
["",null,null,null,null,{"$f":"IF(B16<>\"\",(LOOKUP(T16,Alterskategorie!$A$2:$A$110,Alterskategorie!$B$2:$B$110)),\"\")","v":""},null,null,null,{"$f":"IF(IF(P16=1,K16,IF(AND(K16<>0,D16=D15),J15+K16,0))>J$4,K16,IF(P16=1,K16,IF(AND(K16<>0,D16=D15),J15+K16,0)))","v":0},{"$f":"IF($P16<=M16*6,$G16,0)","v":0},null,{"$f":"IFERROR(LOOKUP($D16,SSV_Organisation[Vereinsname],SSV_Organisation[Grp.Dpp.]),0)","v":0},{"$f":"IF(AND(P16<7,M16>0),1,IF(AND(P16<13,M16>1),2,IF(AND(P16<19,M16>2),3,IF(AND(P16<25,M16>3),4,IF(AND(P16<31,M16>4),5,IF(AND(P16<37,M16>5),6,0))))))","v":0},2,"","","","","",{"$f":"IF(T16<>\"\",(LOOKUP(T16,Alterskategorie!$A$2:$A$110,Alterskategorie!$B$2:$B$110)),\"\")","v":""}]
["",null,null,null,null,{"$f":"IF(B17<>\"\",(LOOKUP(T17,Alterskategorie!$A$2:$A$110,Alterskategorie!$B$2:$B$110)),\"\")","v":""},null,null,null,{"$f":"IF(IF(P17=1,K17,IF(AND(K17<>0,D17=D16),J16+K17,0))>J$4,K17,IF(P17=1,K17,IF(AND(K17<>0,D17=D16),J16+K17,0)))","v":0},{"$f":"IF($P17<=M17*6,$G17,0)","v":0},null,{"$f":"IFERROR(LOOKUP($D17,SSV_Organisation[Vereinsname],SSV_Organisation[Grp.Dpp.]),0)","v":0},{"$f":"IF(AND(P17<7,M17>0),1,IF(AND(P17<13,M17>1),2,IF(AND(P17<19,M17>2),3,IF(AND(P17<25,M17>3),4,IF(AND(P17<31,M17>4),5,IF(AND(P17<37,M17>5),6,0))))))","v":0},4,"","","","","",{"$f":"IF(T17<>\"\",(LOOKUP(T17,Alterskategorie!$A$2:$A$110,Alterskategorie!$B$2:$B$110)),\"\")","v":""}]
["",null,null,null,null,{"$f":"IF(B18<>\"\",(LOOKUP(T18,Alterskategorie!$A$2:$A$110,Alterskategorie!$B$2:$B$110)),\"\")","v":""},null,null,null,{"$f":"IF(IF(P18=1,K18,IF(AND(K18<>0,D18=D17),J17+K18,0))>J$4,K18,IF(P18=1,K18,IF(AND(K18<>0,D18=D17),J17+K18,0)))","v":0},{"$f":"IF($P18<=M18*6,$G18,0)","v":0},null,{"$f":"IFERROR(LOOKUP($D18,SSV_Organisation[Vereinsname],SSV_Organisation[Grp.Dpp.]),0)","v":0},{"$f":"IF(AND(P18<7,M18>0),1,IF(AND(P18<13,M18>1),2,IF(AND(P18<19,M18>2),3,IF(AND(P18<25,M18>3),4,IF(AND(P18<31,M18>4),5,IF(AND(P18<37,M18>5),6,0))))))","v":0},380,"","","","","",{"$f":"IF(T18<>\"\",(LOOKUP(T18,Alterskategorie!$A$2:$A$110,Alterskategorie!$B$2:$B$110)),\"\")","v":""}]
["",null,null,null,null,{"$f":"IF(B19<>\"\",(LOOKUP(T19,Alterskategorie!$A$2:$A$110,Alterskategorie!$B$2:$B$110)),\"\")","v":""},null,null,null,{"$f":"IF(IF(P19=1,K19,IF(AND(K19<>0,D19=D18),J18+K19,0))>J$4,K19,IF(P19=1,K19,IF(AND(K19<>0,D19=D18),J18+K19,0)))","v":0},{"$f":"IF($P19<=M19*6,$G19,0)","v":0},null,{"$f":"IFERROR(LOOKUP($D19,SSV_Organisation[Vereinsname],SSV_Organisation[Grp.Dpp.]),0)","v":0},{"$f":"IF(AND(P19<7,M19>0),1,IF(AND(P19<13,M19>1),2,IF(AND(P19<19,M19>2),3,IF(AND(P19<25,M19>3),4,IF(AND(P19<31,M19>4),5,IF(AND(P19<37,M19>5),6,0))))))","v":0},379,"","","","","",{"$f":"IF(T19<>\"\",(LOOKUP(T19,Alterskategorie!$A$2:$A$110,Alterskategorie!$B$2:$B$110)),\"\")","v":""}]
["",null,null,null,null,{"$f":"IF(B20<>\"\",(LOOKUP(T20,Alterskategorie!$A$2:$A$110,Alterskategorie!$B$2:$B$110)),\"\")","v":""},null,null,null,{"$f":"IF(IF(P20=1,K20,IF(AND(K20<>0,D20=D19),J19+K20,0))>J$4,K20,IF(P20=1,K20,IF(AND(K20<>0,D20=D19),J19+K20,0)))","v":0},{"$f":"IF($P20<=M20*6,$G20,0)","v":0},null,{"$f":"IFERROR(LOOKUP($D20,SSV_Organisation[Vereinsname],SSV_Organisation[Grp.Dpp.]),0)","v":0},{"$f":"IF(AND(P20<7,M20>0),1,IF(AND(P20<13,M20>1),2,IF(AND(P20<19,M20>2),3,IF(AND(P20<25,M20>3),4,IF(AND(P20<31,M20>4),5,IF(AND(P20<37,M20>5),6,0))))))","v":0},195,"","","","","",{"$f":"IF(T20<>\"\",(LOOKUP(T20,Alterskategorie!$A$2:$A$110,Alterskategorie!$B$2:$B$110)),\"\")","v":""}]
["",null,null,null,null,{"$f":"IF(B21<>\"\",(LOOKUP(T21,Alterskategorie!$A$2:$A$110,Alterskategorie!$B$2:$B$110)),\"\")","v":""},null,null,null,{"$f":"IF(IF(P21=1,K21,IF(AND(K21<>0,D21=D20),J20+K21,0))>J$4,K21,IF(P21=1,K21,IF(AND(K21<>0,D21=D20),J20+K21,0)))","v":0},{"$f":"IF($P21<=M21*6,$G21,0)","v":0},null,{"$f":"IFERROR(LOOKUP($D21,SSV_Organisation[Vereinsname],SSV_Organisation[Grp.Dpp.]),0)","v":0},{"$f":"IF(AND(P21<7,M21>0),1,IF(AND(P21<13,M21>1),2,IF(AND(P21<19,M21>2),3,IF(AND(P21<25,M21>3),4,IF(AND(P21<31,M21>4),5,IF(AND(P21<37,M21>5),6,0))))))","v":0},196,"","","","","",{"$f":"IF(T21<>\"\",(LOOKUP(T21,Alterskategorie!$A$2:$A$110,Alterskategorie!$B$2:$B$110)),\"\")","v":""}]
["",null,null,null,null,{"$f":"IF(B22<>\"\",(LOOKUP(T22,Alterskategorie!$A$2:$A$110,Alterskategorie!$B$2:$B$110)),\"\")","v":""},null,null,null,{"$f":"IF(IF(P22=1,K22,IF(AND(K22<>0,D22=D21),J21+K22,0))>J$4,K22,IF(P22=1,K22,IF(AND(K22<>0,D22=D21),J21+K22,0)))","v":0},{"$f":"IF($P22<=M22*6,$G22,0)","v":0},null,{"$f":"IFERROR(LOOKUP($D22,SSV_Organisation[Vereinsname],SSV_Organisation[Grp.Dpp.]),0)","v":0},{"$f":"IF(AND(P22<7,M22>0),1,IF(AND(P22<13,M22>1),2,IF(AND(P22<19,M22>2),3,IF(AND(P22<25,M22>3),4,IF(AND(P22<31,M22>4),5,IF(AND(P22<37,M22>5),6,0))))))","v":0},854,"","","","","",{"$f":"IF(T22<>\"\",(LOOKUP(T22,Alterskategorie!$A$2:$A$110,Alterskategorie!$B$2:$B$110)),\"\")","v":""}]
["",null,null,null,null,{"$f":"IF(B23<>\"\",(LOOKUP(T23,Alterskategorie!$A$2:$A$110,Alterskategorie!$B$2:$B$110)),\"\")","v":""},null,null,null,{"$f":"IF(IF(P23=1,K23,IF(AND(K23<>0,D23=D22),J22+K23,0))>J$4,K23,IF(P23=1,K23,IF(AND(K23<>0,D23=D22),J22+K23,0)))","v":0},{"$f":"IF($P23<=M23*6,$G23,0)","v":0},null,{"$f":"IFERROR(LOOKUP($D23,SSV_Organisation[Vereinsname],SSV_Organisation[Grp.Dpp.]),0)","v":0},{"$f":"IF(AND(P23<7,M23>0),1,IF(AND(P23<13,M23>1),2,IF(AND(P23<19,M23>2),3,IF(AND(P23<25,M23>3),4,IF(AND(P23<31,M23>4),5,IF(AND(P23<37,M23>5),6,0))))))","v":0},539,"","","","","",{"$f":"IF(T23<>\"\",(LOOKUP(T23,Alterskategorie!$A$2:$A$110,Alterskategorie!$B$2:$B$110)),\"\")","v":""}]
["",null,null,null,null,{"$f":"IF(B24<>\"\",(LOOKUP(T24,Alterskategorie!$A$2:$A$110,Alterskategorie!$B$2:$B$110)),\"\")","v":""},null,null,null,{"$f":"IF(IF(P24=1,K24,IF(AND(K24<>0,D24=D23),J23+K24,0))>J$4,K24,IF(P24=1,K24,IF(AND(K24<>0,D24=D23),J23+K24,0)))","v":0},{"$f":"IF($P24<=M24*6,$G24,0)","v":0},null,{"$f":"IFERROR(LOOKUP($D24,SSV_Organisation[Vereinsname],SSV_Organisation[Grp.Dpp.]),0)","v":0},{"$f":"IF(AND(P24<7,M24>0),1,IF(AND(P24<13,M24>1),2,IF(AND(P24<19,M24>2),3,IF(AND(P24<25,M24>3),4,IF(AND(P24<31,M24>4),5,IF(AND(P24<37,M24>5),6,0))))))","v":0},199,"","","","","",{"$f":"IF(T24<>\"\",(LOOKUP(T24,Alterskategorie!$A$2:$A$110,Alterskategorie!$B$2:$B$110)),\"\")","v":""}]
["",null,null,null,null,{"$f":"IF(B25<>\"\",(LOOKUP(T25,Alterskategorie!$A$2:$A$110,Alterskategorie!$B$2:$B$110)),\"\")","v":""},null,null,null,{"$f":"IF(IF(P25=1,K25,IF(AND(K25<>0,D25=D24),J24+K25,0))>J$4,K25,IF(P25=1,K25,IF(AND(K25<>0,D25=D24),J24+K25,0)))","v":0},{"$f":"IF($P25<=M25*6,$G25,0)","v":0},null,{"$f":"IFERROR(LOOKUP($D25,SSV_Organisation[Vereinsname],SSV_Organisation[Grp.Dpp.]),0)","v":0},{"$f":"IF(AND(P25<7,M25>0),1,IF(AND(P25<13,M25>1),2,IF(AND(P25<19,M25>2),3,IF(AND(P25<25,M25>3),4,IF(AND(P25<31,M25>4),5,IF(AND(P25<37,M25>5),6,0))))))","v":0},197,"","","","","",{"$f":"IF(T25<>\"\",(LOOKUP(T25,Alterskategorie!$A$2:$A$110,Alterskategorie!$B$2:$B$110)),\"\")","v":""}]
["",null,null,null,null,{"$f":"IF(B26<>\"\",(LOOKUP(T26,Alterskategorie!$A$2:$A$110,Alterskategorie!$B$2:$B$110)),\"\")","v":""},null,null,null,{"$f":"IF(IF(P26=1,K26,IF(AND(K26<>0,D26=D25),J25+K26,0))>J$4,K26,IF(P26=1,K26,IF(AND(K26<>0,D26=D25),J25+K26,0)))","v":0},{"$f":"IF($P26<=M26*6,$G26,0)","v":0},null,{"$f":"IFERROR(LOOKUP($D26,SSV_Organisation[Vereinsname],SSV_Organisation[Grp.Dpp.]),0)","v":0},{"$f":"IF(AND(P26<7,M26>0),1,IF(AND(P26<13,M26>1),2,IF(AND(P26<19,M26>2),3,IF(AND(P26<25,M26>3),4,IF(AND(P26<31,M26>4),5,IF(AND(P26<37,M26>5),6,0))))))","v":0},202,"","","","","",{"$f":"IF(T26<>\"\",(LOOKUP(T26,Alterskategorie!$A$2:$A$110,Alterskategorie!$B$2:$B$110)),\"\")","v":""}]
["",null,null,null,null,{"$f":"IF(B27<>\"\",(LOOKUP(T27,Alterskategorie!$A$2:$A$110,Alterskategorie!$B$2:$B$110)),\"\")","v":""},null,null,null,{"$f":"IF(IF(P27=1,K27,IF(AND(K27<>0,D27=D26),J26+K27,0))>J$4,K27,IF(P27=1,K27,IF(AND(K27<>0,D27=D26),J26+K27,0)))","v":0},{"$f":"IF($P27<=M27*6,$G27,0)","v":0},null,{"$f":"IFERROR(LOOKUP($D27,SSV_Organisation[Vereinsname],SSV_Organisation[Grp.Dpp.]),0)","v":0},{"$f":"IF(AND(P27<7,M27>0),1,IF(AND(P27<13,M27>1),2,IF(AND(P27<19,M27>2),3,IF(AND(P27<25,M27>3),4,IF(AND(P27<31,M27>4),5,IF(AND(P27<37,M27>5),6,0))))))","v":0},200,"","","","","",{"$f":"IF(T27<>\"\",(LOOKUP(T27,Alterskategorie!$A$2:$A$110,Alterskategorie!$B$2:$B$110)),\"\")","v":""}]
["",null,null,null,null,{"$f":"IF(B28<>\"\",(LOOKUP(T28,Alterskategorie!$A$2:$A$110,Alterskategorie!$B$2:$B$110)),\"\")","v":""},null,null,null,{"$f":"IF(IF(P28=1,K28,IF(AND(K28<>0,D28=D27),J27+K28,0))>J$4,K28,IF(P28=1,K28,IF(AND(K28<>0,D28=D27),J27+K28,0)))","v":0},{"$f":"IF($P28<=M28*6,$G28,0)","v":0},null,{"$f":"IFERROR(LOOKUP($D28,SSV_Organisation[Vereinsname],SSV_Organisation[Grp.Dpp.]),0)","v":0},{"$f":"IF(AND(P28<7,M28>0),1,IF(AND(P28<13,M28>1),2,IF(AND(P28<19,M28>2),3,IF(AND(P28<25,M28>3),4,IF(AND(P28<31,M28>4),5,IF(AND(P28<37,M28>5),6,0))))))","v":0},201,"","","","","",{"$f":"IF(T28<>\"\",(LOOKUP(T28,Alterskategorie!$A$2:$A$110,Alterskategorie!$B$2:$B$110)),\"\")","v":""}]
["",null,null,null,null,{"$f":"IF(B29<>\"\",(LOOKUP(T29,Alterskategorie!$A$2:$A$110,Alterskategorie!$B$2:$B$110)),\"\")","v":""},null,null,null,{"$f":"IF(IF(P29=1,K29,IF(AND(K29<>0,D29=D28),J28+K29,0))>J$4,K29,IF(P29=1,K29,IF(AND(K29<>0,D29=D28),J28+K29,0)))","v":0},{"$f":"IF($P29<=M29*6,$G29,0)","v":0},null,{"$f":"IFERROR(LOOKUP($D29,SSV_Organisation[Vereinsname],SSV_Organisation[Grp.Dpp.]),0)","v":0},{"$f":"IF(AND(P29<7,M29>0),1,IF(AND(P29<13,M29>1),2,IF(AND(P29<19,M29>2),3,IF(AND(P29<25,M29>3),4,IF(AND(P29<31,M29>4),5,IF(AND(P29<37,M29>5),6,0))))))","v":0},203,"","","","","",{"$f":"IF(T29<>\"\",(LOOKUP(T29,Alterskategorie!$A$2:$A$110,Alterskategorie!$B$2:$B$110)),\"\")","v":""}]
["",null,null,null,null,{"$f":"IF(B30<>\"\",(LOOKUP(T30,Alterskategorie!$A$2:$A$110,Alterskategorie!$B$2:$B$110)),\"\")","v":""},null,null,null,{"$f":"IF(IF(P30=1,K30,IF(AND(K30<>0,D30=D29),J29+K30,0))>J$4,K30,IF(P30=1,K30,IF(AND(K30<>0,D30=D29),J29+K30,0)))","v":0},{"$f":"IF($P30<=M30*6,$G30,0)","v":0},null,{"$f":"IFERROR(LOOKUP($D30,SSV_Organisation[Vereinsname],SSV_Organisation[Grp.Dpp.]),0)","v":0},{"$f":"IF(AND(P30<7,M30>0),1,IF(AND(P30<13,M30>1),2,IF(AND(P30<19,M30>2),3,IF(AND(P30<25,M30>3),4,IF(AND(P30<31,M30>4),5,IF(AND(P30<37,M30>5),6,0))))))","v":0},540,"","","","","",{"$f":"IF(T30<>\"\",(LOOKUP(T30,Alterskategorie!$A$2:$A$110,Alterskategorie!$B$2:$B$110)),\"\")","v":""}]
["",null,null,null,null,{"$f":"IF(B31<>\"\",(LOOKUP(T31,Alterskategorie!$A$2:$A$110,Alterskategorie!$B$2:$B$110)),\"\")","v":""},null,null,null,{"$f":"IF(IF(P31=1,K31,IF(AND(K31<>0,D31=D30),J30+K31,0))>J$4,K31,IF(P31=1,K31,IF(AND(K31<>0,D31=D30),J30+K31,0)))","v":0},{"$f":"IF($P31<=M31*6,$G31,0)","v":0},null,{"$f":"IFERROR(LOOKUP($D31,SSV_Organisation[Vereinsname],SSV_Organisation[Grp.Dpp.]),0)","v":0},{"$f":"IF(AND(P31<7,M31>0),1,IF(AND(P31<13,M31>1),2,IF(AND(P31<19,M31>2),3,IF(AND(P31<25,M31>3),4,IF(AND(P31<31,M31>4),5,IF(AND(P31<37,M31>5),6,0))))))","v":0},204,"","","","","",{"$f":"IF(T31<>\"\",(LOOKUP(T31,Alterskategorie!$A$2:$A$110,Alterskategorie!$B$2:$B$110)),\"\")","v":""}]
["",null,null,null,null,{"$f":"IF(B32<>\"\",(LOOKUP(T32,Alterskategorie!$A$2:$A$110,Alterskategorie!$B$2:$B$110)),\"\")","v":""},null,null,null,{"$f":"IF(IF(P32=1,K32,IF(AND(K32<>0,D32=D31),J31+K32,0))>J$4,K32,IF(P32=1,K32,IF(AND(K32<>0,D32=D31),J31+K32,0)))","v":0},{"$f":"IF($P32<=M32*6,$G32,0)","v":0},null,{"$f":"IFERROR(LOOKUP($D32,SSV_Organisation[Vereinsname],SSV_Organisation[Grp.Dpp.]),0)","v":0},{"$f":"IF(AND(P32<7,M32>0),1,IF(AND(P32<13,M32>1),2,IF(AND(P32<19,M32>2),3,IF(AND(P32<25,M32>3),4,IF(AND(P32<31,M32>4),5,IF(AND(P32<37,M32>5),6,0))))))","v":0},205,"","","","","",{"$f":"IF(T32<>\"\",(LOOKUP(T32,Alterskategorie!$A$2:$A$110,Alterskategorie!$B$2:$B$110)),\"\")","v":""}]
["",null,null,null,null,{"$f":"IF(B33<>\"\",(LOOKUP(T33,Alterskategorie!$A$2:$A$110,Alterskategorie!$B$2:$B$110)),\"\")","v":""},null,null,null,{"$f":"IF(IF(P33=1,K33,IF(AND(K33<>0,D33=D32),J32+K33,0))>J$4,K33,IF(P33=1,K33,IF(AND(K33<>0,D33=D32),J32+K33,0)))","v":0},{"$f":"IF($P33<=M33*6,$G33,0)","v":0},null,{"$f":"IFERROR(LOOKUP($D33,SSV_Organisation[Vereinsname],SSV_Organisation[Grp.Dpp.]),0)","v":0},{"$f":"IF(AND(P33<7,M33>0),1,IF(AND(P33<13,M33>1),2,IF(AND(P33<19,M33>2),3,IF(AND(P33<25,M33>3),4,IF(AND(P33<31,M33>4),5,IF(AND(P33<37,M33>5),6,0))))))","v":0},82,"","","","","",{"$f":"IF(T33<>\"\",(LOOKUP(T33,Alterskategorie!$A$2:$A$110,Alterskategorie!$B$2:$B$110)),\"\")","v":""}]
["",null,null,null,null,{"$f":"IF(B34<>\"\",(LOOKUP(T34,Alterskategorie!$A$2:$A$110,Alterskategorie!$B$2:$B$110)),\"\")","v":""},null,null,null,{"$f":"IF(IF(P34=1,K34,IF(AND(K34<>0,D34=D33),J33+K34,0))>J$4,K34,IF(P34=1,K34,IF(AND(K34<>0,D34=D33),J33+K34,0)))","v":0},{"$f":"IF($P34<=M34*6,$G34,0)","v":0},null,{"$f":"IFERROR(LOOKUP($D34,SSV_Organisation[Vereinsname],SSV_Organisation[Grp.Dpp.]),0)","v":0},{"$f":"IF(AND(P34<7,M34>0),1,IF(AND(P34<13,M34>1),2,IF(AND(P34<19,M34>2),3,IF(AND(P34<25,M34>3),4,IF(AND(P34<31,M34>4),5,IF(AND(P34<37,M34>5),6,0))))))","v":0},207,"","","","","",{"$f":"IF(T34<>\"\",(LOOKUP(T34,Alterskategorie!$A$2:$A$110,Alterskategorie!$B$2:$B$110)),\"\")","v":""}]
["",null,null,null,null,{"$f":"IF(B35<>\"\",(LOOKUP(T35,Alterskategorie!$A$2:$A$110,Alterskategorie!$B$2:$B$110)),\"\")","v":""},null,null,null,{"$f":"IF(IF(P35=1,K35,IF(AND(K35<>0,D35=D34),J34+K35,0))>J$4,K35,IF(P35=1,K35,IF(AND(K35<>0,D35=D34),J34+K35,0)))","v":0},{"$f":"IF($P35<=M35*6,$G35,0)","v":0},null,{"$f":"IFERROR(LOOKUP($D35,SSV_Organisation[Vereinsname],SSV_Organisation[Grp.Dpp.]),0)","v":0},{"$f":"IF(AND(P35<7,M35>0),1,IF(AND(P35<13,M35>1),2,IF(AND(P35<19,M35>2),3,IF(AND(P35<25,M35>3),4,IF(AND(P35<31,M35>4),5,IF(AND(P35<37,M35>5),6,0))))))","v":0},206,"","","","","",{"$f":"IF(T35<>\"\",(LOOKUP(T35,Alterskategorie!$A$2:$A$110,Alterskategorie!$B$2:$B$110)),\"\")","v":""}]
["",null,null,null,null,{"$f":"IF(B36<>\"\",(LOOKUP(T36,Alterskategorie!$A$2:$A$110,Alterskategorie!$B$2:$B$110)),\"\")","v":""},null,null,null,{"$f":"IF(IF(P36=1,K36,IF(AND(K36<>0,D36=D35),J35+K36,0))>J$4,K36,IF(P36=1,K36,IF(AND(K36<>0,D36=D35),J35+K36,0)))","v":0},{"$f":"IF($P36<=M36*6,$G36,0)","v":0},null,{"$f":"IFERROR(LOOKUP($D36,SSV_Organisation[Vereinsname],SSV_Organisation[Grp.Dpp.]),0)","v":0},{"$f":"IF(AND(P36<7,M36>0),1,IF(AND(P36<13,M36>1),2,IF(AND(P36<19,M36>2),3,IF(AND(P36<25,M36>3),4,IF(AND(P36<31,M36>4),5,IF(AND(P36<37,M36>5),6,0))))))","v":0},859,"","","","","",{"$f":"IF(T36<>\"\",(LOOKUP(T36,Alterskategorie!$A$2:$A$110,Alterskategorie!$B$2:$B$110)),\"\")","v":""}]
["",null,null,null,null,{"$f":"IF(B37<>\"\",(LOOKUP(T37,Alterskategorie!$A$2:$A$110,Alterskategorie!$B$2:$B$110)),\"\")","v":""},null,null,null,{"$f":"IF(IF(P37=1,K37,IF(AND(K37<>0,D37=D36),J36+K37,0))>J$4,K37,IF(P37=1,K37,IF(AND(K37<>0,D37=D36),J36+K37,0)))","v":0},{"$f":"IF($P37<=M37*6,$G37,0)","v":0},null,{"$f":"IFERROR(LOOKUP($D37,SSV_Organisation[Vereinsname],SSV_Organisation[Grp.Dpp.]),0)","v":0},{"$f":"IF(AND(P37<7,M37>0),1,IF(AND(P37<13,M37>1),2,IF(AND(P37<19,M37>2),3,IF(AND(P37<25,M37>3),4,IF(AND(P37<31,M37>4),5,IF(AND(P37<37,M37>5),6,0))))))","v":0},209,"","","","","",{"$f":"IF(T37<>\"\",(LOOKUP(T37,Alterskategorie!$A$2:$A$110,Alterskategorie!$B$2:$B$110)),\"\")","v":""}]
["",null,null,null,null,{"$f":"IF(B38<>\"\",(LOOKUP(T38,Alterskategorie!$A$2:$A$110,Alterskategorie!$B$2:$B$110)),\"\")","v":""},null,null,null,{"$f":"IF(IF(P38=1,K38,IF(AND(K38<>0,D38=D37),J37+K38,0))>J$4,K38,IF(P38=1,K38,IF(AND(K38<>0,D38=D37),J37+K38,0)))","v":0},{"$f":"IF($P38<=M38*6,$G38,0)","v":0},null,{"$f":"IFERROR(LOOKUP($D38,SSV_Organisation[Vereinsname],SSV_Organisation[Grp.Dpp.]),0)","v":0},{"$f":"IF(AND(P38<7,M38>0),1,IF(AND(P38<13,M38>1),2,IF(AND(P38<19,M38>2),3,IF(AND(P38<25,M38>3),4,IF(AND(P38<31,M38>4),5,IF(AND(P38<37,M38>5),6,0))))))","v":0},839,"","","","","",{"$f":"IF(T38<>\"\",(LOOKUP(T38,Alterskategorie!$A$2:$A$110,Alterskategorie!$B$2:$B$110)),\"\")","v":""}]
["",null,null,null,null,{"$f":"IF(B39<>\"\",(LOOKUP(T39,Alterskategorie!$A$2:$A$110,Alterskategorie!$B$2:$B$110)),\"\")","v":""},null,null,null,{"$f":"IF(IF(P39=1,K39,IF(AND(K39<>0,D39=D38),J38+K39,0))>J$4,K39,IF(P39=1,K39,IF(AND(K39<>0,D39=D38),J38+K39,0)))","v":0},{"$f":"IF($P39<=M39*6,$G39,0)","v":0},null,{"$f":"IFERROR(LOOKUP($D39,SSV_Organisation[Vereinsname],SSV_Organisation[Grp.Dpp.]),0)","v":0},{"$f":"IF(AND(P39<7,M39>0),1,IF(AND(P39<13,M39>1),2,IF(AND(P39<19,M39>2),3,IF(AND(P39<25,M39>3),4,IF(AND(P39<31,M39>4),5,IF(AND(P39<37,M39>5),6,0))))))","v":0},544,"","","","","",{"$f":"IF(T39<>\"\",(LOOKUP(T39,Alterskategorie!$A$2:$A$110,Alterskategorie!$B$2:$B$110)),\"\")","v":""}]
["",null,null,null,null,{"$f":"IF(B40<>\"\",(LOOKUP(T40,Alterskategorie!$A$2:$A$110,Alterskategorie!$B$2:$B$110)),\"\")","v":""},null,null,null,{"$f":"IF(IF(P40=1,K40,IF(AND(K40<>0,D40=D39),J39+K40,0))>J$4,K40,IF(P40=1,K40,IF(AND(K40<>0,D40=D39),J39+K40,0)))","v":0},{"$f":"IF($P40<=M40*6,$G40,0)","v":0},null,{"$f":"IFERROR(LOOKUP($D40,SSV_Organisation[Vereinsname],SSV_Organisation[Grp.Dpp.]),0)","v":0},{"$f":"IF(AND(P40<7,M40>0),1,IF(AND(P40<13,M40>1),2,IF(AND(P40<19,M40>2),3,IF(AND(P40<25,M40>3),4,IF(AND(P40<31,M40>4),5,IF(AND(P40<37,M40>5),6,0))))))","v":0},210,"","","","","",{"$f":"IF(T40<>\"\",(LOOKUP(T40,Alterskategorie!$A$2:$A$110,Alterskategorie!$B$2:$B$110)),\"\")","v":""}]
["",null,null,null,null,{"$f":"IF(B41<>\"\",(LOOKUP(T41,Alterskategorie!$A$2:$A$110,Alterskategorie!$B$2:$B$110)),\"\")","v":""},null,null,null,{"$f":"IF(IF(P41=1,K41,IF(AND(K41<>0,D41=D40),J40+K41,0))>J$4,K41,IF(P41=1,K41,IF(AND(K41<>0,D41=D40),J40+K41,0)))","v":0},{"$f":"IF($P41<=M41*6,$G41,0)","v":0},null,{"$f":"IFERROR(LOOKUP($D41,SSV_Organisation[Vereinsname],SSV_Organisation[Grp.Dpp.]),0)","v":0},{"$f":"IF(AND(P41<7,M41>0),1,IF(AND(P41<13,M41>1),2,IF(AND(P41<19,M41>2),3,IF(AND(P41<25,M41>3),4,IF(AND(P41<31,M41>4),5,IF(AND(P41<37,M41>5),6,0))))))","v":0},860,"","","","","",{"$f":"IF(T41<>\"\",(LOOKUP(T41,Alterskategorie!$A$2:$A$110,Alterskategorie!$B$2:$B$110)),\"\")","v":""}]
[{"$f":"IF(B42>\"\",A41+1,\"\")","v":""},null,null,null,null,{"$f":"IF(B42<>\"\",(LOOKUP(T42,Alterskategorie!$A$2:$A$110,Alterskategorie!$B$2:$B$110)),\"\")","v":""},null,null,null,{"$f":"IF(IF(P42=1,K42,IF(AND(K42<>0,D42=D41),J41+K42,0))>J$4,K42,IF(P42=1,K42,IF(AND(K42<>0,D42=D41),J41+K42,0)))","v":0},{"$f":"IF($P42<=M42*6,$G42,0)","v":0},null,{"$f":"IFERROR(LOOKUP($D42,SSV_Organisation[Vereinsname],SSV_Organisation[Grp.Dpp.]),0)","v":0},{"$f":"IF(AND(P42<7,M42>0),1,IF(AND(P42<13,M42>1),2,IF(AND(P42<19,M42>2),3,IF(AND(P42<25,M42>3),4,IF(AND(P42<31,M42>4),5,IF(AND(P42<37,M42>5),6,0))))))","v":0},919,"","","","","",{"$f":"IF(T42<>\"\",(LOOKUP(T42,Alterskategorie!$A$2:$A$110,Alterskategorie!$B$2:$B$110)),\"\")","v":""}]
["",null,null,null,null,{"$f":"IF(B43<>\"\",(LOOKUP(T43,Alterskategorie!$A$2:$A$110,Alterskategorie!$B$2:$B$110)),\"\")","v":""},null,null,null,{"$f":"IF(IF(P43=1,K43,IF(AND(K43<>0,D43=D42),J42+K43,0))>J$4,K43,IF(P43=1,K43,IF(AND(K43<>0,D43=D42),J42+K43,0)))","v":0},{"$f":"IF($P43<=M43*6,$G43,0)","v":0},null,{"$f":"IFERROR(LOOKUP($D43,SSV_Organisation[Vereinsname],SSV_Organisation[Grp.Dpp.]),0)","v":0},{"$f":"IF(AND(P43<7,M43>0),1,IF(AND(P43<13,M43>1),2,IF(AND(P43<19,M43>2),3,IF(AND(P43<25,M43>3),4,IF(AND(P43<31,M43>4),5,IF(AND(P43<37,M43>5),6,0))))))","v":0},545,"","","","","",{"$f":"IF(T43<>\"\",(LOOKUP(T43,Alterskategorie!$A$2:$A$110,Alterskategorie!$B$2:$B$110)),\"\")","v":""}]
["",null,null,null,null,{"$f":"IF(B44<>\"\",(LOOKUP(T44,Alterskategorie!$A$2:$A$110,Alterskategorie!$B$2:$B$110)),\"\")","v":""},null,null,null,{"$f":"IF(IF(P44=1,K44,IF(AND(K44<>0,D44=D43),J43+K44,0))>J$4,K44,IF(P44=1,K44,IF(AND(K44<>0,D44=D43),J43+K44,0)))","v":0},{"$f":"IF($P44<=M44*6,$G44,0)","v":0},null,{"$f":"IFERROR(LOOKUP($D44,SSV_Organisation[Vereinsname],SSV_Organisation[Grp.Dpp.]),0)","v":0},{"$f":"IF(AND(P44<7,M44>0),1,IF(AND(P44<13,M44>1),2,IF(AND(P44<19,M44>2),3,IF(AND(P44<25,M44>3),4,IF(AND(P44<31,M44>4),5,IF(AND(P44<37,M44>5),6,0))))))","v":0},841,"","","","","",{"$f":"IF(T44<>\"\",(LOOKUP(T44,Alterskategorie!$A$2:$A$110,Alterskategorie!$B$2:$B$110)),\"\")","v":""}]
["",null,null,null,null,{"$f":"IF(B45<>\"\",(LOOKUP(T45,Alterskategorie!$A$2:$A$110,Alterskategorie!$B$2:$B$110)),\"\")","v":""},null,null,null,{"$f":"IF(IF(P45=1,K45,IF(AND(K45<>0,D45=D44),J44+K45,0))>J$4,K45,IF(P45=1,K45,IF(AND(K45<>0,D45=D44),J44+K45,0)))","v":0},{"$f":"IF($P45<=M45*6,$G45,0)","v":0},null,{"$f":"IFERROR(LOOKUP($D45,SSV_Organisation[Vereinsname],SSV_Organisation[Grp.Dpp.]),0)","v":0},{"$f":"IF(AND(P45<7,M45>0),1,IF(AND(P45<13,M45>1),2,IF(AND(P45<19,M45>2),3,IF(AND(P45<25,M45>3),4,IF(AND(P45<31,M45>4),5,IF(AND(P45<37,M45>5),6,0))))))","v":0},548,"","","","","",{"$f":"IF(T45<>\"\",(LOOKUP(T45,Alterskategorie!$A$2:$A$110,Alterskategorie!$B$2:$B$110)),\"\")","v":""}]
["",null,null,null,null,{"$f":"IF(B46<>\"\",(LOOKUP(T46,Alterskategorie!$A$2:$A$110,Alterskategorie!$B$2:$B$110)),\"\")","v":""},null,null,null,{"$f":"IF(IF(P46=1,K46,IF(AND(K46<>0,D46=D45),J45+K46,0))>J$4,K46,IF(P46=1,K46,IF(AND(K46<>0,D46=D45),J45+K46,0)))","v":0},{"$f":"IF($P46<=M46*6,$G46,0)","v":0},null,{"$f":"IFERROR(LOOKUP($D46,SSV_Organisation[Vereinsname],SSV_Organisation[Grp.Dpp.]),0)","v":0},{"$f":"IF(AND(P46<7,M46>0),1,IF(AND(P46<13,M46>1),2,IF(AND(P46<19,M46>2),3,IF(AND(P46<25,M46>3),4,IF(AND(P46<31,M46>4),5,IF(AND(P46<37,M46>5),6,0))))))","v":0},84,"","","","","",{"$f":"IF(T46<>\"\",(LOOKUP(T46,Alterskategorie!$A$2:$A$110,Alterskategorie!$B$2:$B$110)),\"\")","v":""}]
["",null,null,null,null,{"$f":"IF(B47<>\"\",(LOOKUP(T47,Alterskategorie!$A$2:$A$110,Alterskategorie!$B$2:$B$110)),\"\")","v":""},null,null,null,{"$f":"IF(IF(P47=1,K47,IF(AND(K47<>0,D47=D46),J46+K47,0))>J$4,K47,IF(P47=1,K47,IF(AND(K47<>0,D47=D46),J46+K47,0)))","v":0},{"$f":"IF($P47<=M47*6,$G47,0)","v":0},null,{"$f":"IFERROR(LOOKUP($D47,SSV_Organisation[Vereinsname],SSV_Organisation[Grp.Dpp.]),0)","v":0},{"$f":"IF(AND(P47<7,M47>0),1,IF(AND(P47<13,M47>1),2,IF(AND(P47<19,M47>2),3,IF(AND(P47<25,M47>3),4,IF(AND(P47<31,M47>4),5,IF(AND(P47<37,M47>5),6,0))))))","v":0},211,"","","","","",{"$f":"IF(T47<>\"\",(LOOKUP(T47,Alterskategorie!$A$2:$A$110,Alterskategorie!$B$2:$B$110)),\"\")","v":""}]
["",null,null,null,null,{"$f":"IF(B48<>\"\",(LOOKUP(T48,Alterskategorie!$A$2:$A$110,Alterskategorie!$B$2:$B$110)),\"\")","v":""},null,null,null,{"$f":"IF(IF(P48=1,K48,IF(AND(K48<>0,D48=D47),J47+K48,0))>J$4,K48,IF(P48=1,K48,IF(AND(K48<>0,D48=D47),J47+K48,0)))","v":0},{"$f":"IF($P48<=M48*6,$G48,0)","v":0},null,{"$f":"IFERROR(LOOKUP($D48,SSV_Organisation[Vereinsname],SSV_Organisation[Grp.Dpp.]),0)","v":0},{"$f":"IF(AND(P48<7,M48>0),1,IF(AND(P48<13,M48>1),2,IF(AND(P48<19,M48>2),3,IF(AND(P48<25,M48>3),4,IF(AND(P48<31,M48>4),5,IF(AND(P48<37,M48>5),6,0))))))","v":0},923,"","","","","",{"$f":"IF(T48<>\"\",(LOOKUP(T48,Alterskategorie!$A$2:$A$110,Alterskategorie!$B$2:$B$110)),\"\")","v":""}]
["",null,null,null,null,{"$f":"IF(B49<>\"\",(LOOKUP(T49,Alterskategorie!$A$2:$A$110,Alterskategorie!$B$2:$B$110)),\"\")","v":""},null,null,null,{"$f":"IF(IF(P49=1,K49,IF(AND(K49<>0,D49=D48),J48+K49,0))>J$4,K49,IF(P49=1,K49,IF(AND(K49<>0,D49=D48),J48+K49,0)))","v":0},{"$f":"IF($P49<=M49*6,$G49,0)","v":0},null,{"$f":"IFERROR(LOOKUP($D49,SSV_Organisation[Vereinsname],SSV_Organisation[Grp.Dpp.]),0)","v":0},{"$f":"IF(AND(P49<7,M49>0),1,IF(AND(P49<13,M49>1),2,IF(AND(P49<19,M49>2),3,IF(AND(P49<25,M49>3),4,IF(AND(P49<31,M49>4),5,IF(AND(P49<37,M49>5),6,0))))))","v":0},212,"","","","","",{"$f":"IF(T49<>\"\",(LOOKUP(T49,Alterskategorie!$A$2:$A$110,Alterskategorie!$B$2:$B$110)),\"\")","v":""}]
["",null,null,null,null,{"$f":"IF(B50<>\"\",(LOOKUP(T50,Alterskategorie!$A$2:$A$110,Alterskategorie!$B$2:$B$110)),\"\")","v":""},null,null,null,{"$f":"IF(IF(P50=1,K50,IF(AND(K50<>0,D50=D49),J49+K50,0))>J$4,K50,IF(P50=1,K50,IF(AND(K50<>0,D50=D49),J49+K50,0)))","v":0},{"$f":"IF($P50<=M50*6,$G50,0)","v":0},null,{"$f":"IFERROR(LOOKUP($D50,SSV_Organisation[Vereinsname],SSV_Organisation[Grp.Dpp.]),0)","v":0},{"$f":"IF(AND(P50<7,M50>0),1,IF(AND(P50<13,M50>1),2,IF(AND(P50<19,M50>2),3,IF(AND(P50<25,M50>3),4,IF(AND(P50<31,M50>4),5,IF(AND(P50<37,M50>5),6,0))))))","v":0},970,"","","","","",{"$f":"IF(T50<>\"\",(LOOKUP(T50,Alterskategorie!$A$2:$A$110,Alterskategorie!$B$2:$B$110)),\"\")","v":""}]
["",null,null,null,null,{"$f":"IF(B51<>\"\",(LOOKUP(T51,Alterskategorie!$A$2:$A$110,Alterskategorie!$B$2:$B$110)),\"\")","v":""},null,null,null,{"$f":"IF(IF(P51=1,K51,IF(AND(K51<>0,D51=D50),J50+K51,0))>J$4,K51,IF(P51=1,K51,IF(AND(K51<>0,D51=D50),J50+K51,0)))","v":0},{"$f":"IF($P51<=M51*6,$G51,0)","v":0},null,{"$f":"IFERROR(LOOKUP($D51,SSV_Organisation[Vereinsname],SSV_Organisation[Grp.Dpp.]),0)","v":0},{"$f":"IF(AND(P51<7,M51>0),1,IF(AND(P51<13,M51>1),2,IF(AND(P51<19,M51>2),3,IF(AND(P51<25,M51>3),4,IF(AND(P51<31,M51>4),5,IF(AND(P51<37,M51>5),6,0))))))","v":0},932,"","","","","",{"$f":"IF(T51<>\"\",(LOOKUP(T51,Alterskategorie!$A$2:$A$110,Alterskategorie!$B$2:$B$110)),\"\")","v":""}]
["",null,null,null,null,{"$f":"IF(B52<>\"\",(LOOKUP(T52,Alterskategorie!$A$2:$A$110,Alterskategorie!$B$2:$B$110)),\"\")","v":""},null,null,null,{"$f":"IF(IF(P52=1,K52,IF(AND(K52<>0,D52=D51),J51+K52,0))>J$4,K52,IF(P52=1,K52,IF(AND(K52<>0,D52=D51),J51+K52,0)))","v":0},{"$f":"IF($P52<=M52*6,$G52,0)","v":0},null,{"$f":"IFERROR(LOOKUP($D52,SSV_Organisation[Vereinsname],SSV_Organisation[Grp.Dpp.]),0)","v":0},{"$f":"IF(AND(P52<7,M52>0),1,IF(AND(P52<13,M52>1),2,IF(AND(P52<19,M52>2),3,IF(AND(P52<25,M52>3),4,IF(AND(P52<31,M52>4),5,IF(AND(P52<37,M52>5),6,0))))))","v":0},213,"","","","","",{"$f":"IF(T52<>\"\",(LOOKUP(T52,Alterskategorie!$A$2:$A$110,Alterskategorie!$B$2:$B$110)),\"\")","v":""}]
["",null,null,null,null,{"$f":"IF(B53<>\"\",(LOOKUP(T53,Alterskategorie!$A$2:$A$110,Alterskategorie!$B$2:$B$110)),\"\")","v":""},null,null,null,{"$f":"IF(IF(P53=1,K53,IF(AND(K53<>0,D53=D52),J52+K53,0))>J$4,K53,IF(P53=1,K53,IF(AND(K53<>0,D53=D52),J52+K53,0)))","v":0},{"$f":"IF($P53<=M53*6,$G53,0)","v":0},null,{"$f":"IFERROR(LOOKUP($D53,SSV_Organisation[Vereinsname],SSV_Organisation[Grp.Dpp.]),0)","v":0},{"$f":"IF(AND(P53<7,M53>0),1,IF(AND(P53<13,M53>1),2,IF(AND(P53<19,M53>2),3,IF(AND(P53<25,M53>3),4,IF(AND(P53<31,M53>4),5,IF(AND(P53<37,M53>5),6,0))))))","v":0},85,"","","","","",{"$f":"IF(T53<>\"\",(LOOKUP(T53,Alterskategorie!$A$2:$A$110,Alterskategorie!$B$2:$B$110)),\"\")","v":""}]
["",null,null,null,null,{"$f":"IF(B54<>\"\",(LOOKUP(T54,Alterskategorie!$A$2:$A$110,Alterskategorie!$B$2:$B$110)),\"\")","v":""},null,null,null,{"$f":"IF(IF(P54=1,K54,IF(AND(K54<>0,D54=D53),J53+K54,0))>J$4,K54,IF(P54=1,K54,IF(AND(K54<>0,D54=D53),J53+K54,0)))","v":0},{"$f":"IF($P54<=M54*6,$G54,0)","v":0},null,{"$f":"IFERROR(LOOKUP($D54,SSV_Organisation[Vereinsname],SSV_Organisation[Grp.Dpp.]),0)","v":0},{"$f":"IF(AND(P54<7,M54>0),1,IF(AND(P54<13,M54>1),2,IF(AND(P54<19,M54>2),3,IF(AND(P54<25,M54>3),4,IF(AND(P54<31,M54>4),5,IF(AND(P54<37,M54>5),6,0))))))","v":0},844,"","","","","",{"$f":"IF(T54<>\"\",(LOOKUP(T54,Alterskategorie!$A$2:$A$110,Alterskategorie!$B$2:$B$110)),\"\")","v":""}]
["",null,null,null,null,{"$f":"IF(B55<>\"\",(LOOKUP(T55,Alterskategorie!$A$2:$A$110,Alterskategorie!$B$2:$B$110)),\"\")","v":""},null,null,null,{"$f":"IF(IF(P55=1,K55,IF(AND(K55<>0,D55=D54),J54+K55,0))>J$4,K55,IF(P55=1,K55,IF(AND(K55<>0,D55=D54),J54+K55,0)))","v":0},{"$f":"IF($P55<=M55*6,$G55,0)","v":0},null,{"$f":"IFERROR(LOOKUP($D55,SSV_Organisation[Vereinsname],SSV_Organisation[Grp.Dpp.]),0)","v":0},{"$f":"IF(AND(P55<7,M55>0),1,IF(AND(P55<13,M55>1),2,IF(AND(P55<19,M55>2),3,IF(AND(P55<25,M55>3),4,IF(AND(P55<31,M55>4),5,IF(AND(P55<37,M55>5),6,0))))))","v":0},842,"","","","","",{"$f":"IF(T55<>\"\",(LOOKUP(T55,Alterskategorie!$A$2:$A$110,Alterskategorie!$B$2:$B$110)),\"\")","v":""}]
["",null,null,null,null,{"$f":"IF(B56<>\"\",(LOOKUP(T56,Alterskategorie!$A$2:$A$110,Alterskategorie!$B$2:$B$110)),\"\")","v":""},null,null,null,{"$f":"IF(IF(P56=1,K56,IF(AND(K56<>0,D56=D55),J55+K56,0))>J$4,K56,IF(P56=1,K56,IF(AND(K56<>0,D56=D55),J55+K56,0)))","v":0},{"$f":"IF($P56<=M56*6,$G56,0)","v":0},null,{"$f":"IFERROR(LOOKUP($D56,SSV_Organisation[Vereinsname],SSV_Organisation[Grp.Dpp.]),0)","v":0},{"$f":"IF(AND(P56<7,M56>0),1,IF(AND(P56<13,M56>1),2,IF(AND(P56<19,M56>2),3,IF(AND(P56<25,M56>3),4,IF(AND(P56<31,M56>4),5,IF(AND(P56<37,M56>5),6,0))))))","v":0},214,"","","","","",{"$f":"IF(T56<>\"\",(LOOKUP(T56,Alterskategorie!$A$2:$A$110,Alterskategorie!$B$2:$B$110)),\"\")","v":""}]
["",null,null,null,null,{"$f":"IF(B57<>\"\",(LOOKUP(T57,Alterskategorie!$A$2:$A$110,Alterskategorie!$B$2:$B$110)),\"\")","v":""},null,null,null,{"$f":"IF(IF(P57=1,K57,IF(AND(K57<>0,D57=D56),J56+K57,0))>J$4,K57,IF(P57=1,K57,IF(AND(K57<>0,D57=D56),J56+K57,0)))","v":0},{"$f":"IF($P57<=M57*6,$G57,0)","v":0},null,{"$f":"IFERROR(LOOKUP($D57,SSV_Organisation[Vereinsname],SSV_Organisation[Grp.Dpp.]),0)","v":0},{"$f":"IF(AND(P57<7,M57>0),1,IF(AND(P57<13,M57>1),2,IF(AND(P57<19,M57>2),3,IF(AND(P57<25,M57>3),4,IF(AND(P57<31,M57>4),5,IF(AND(P57<37,M57>5),6,0))))))","v":0},862,"","","","","",{"$f":"IF(T57<>\"\",(LOOKUP(T57,Alterskategorie!$A$2:$A$110,Alterskategorie!$B$2:$B$110)),\"\")","v":""}]
["",null,null,null,null,{"$f":"IF(B58<>\"\",(LOOKUP(T58,Alterskategorie!$A$2:$A$110,Alterskategorie!$B$2:$B$110)),\"\")","v":""},null,null,null,{"$f":"IF(IF(P58=1,K58,IF(AND(K58<>0,D58=D57),J57+K58,0))>J$4,K58,IF(P58=1,K58,IF(AND(K58<>0,D58=D57),J57+K58,0)))","v":0},{"$f":"IF($P58<=M58*6,$G58,0)","v":0},null,{"$f":"IFERROR(LOOKUP($D58,SSV_Organisation[Vereinsname],SSV_Organisation[Grp.Dpp.]),0)","v":0},{"$f":"IF(AND(P58<7,M58>0),1,IF(AND(P58<13,M58>1),2,IF(AND(P58<19,M58>2),3,IF(AND(P58<25,M58>3),4,IF(AND(P58<31,M58>4),5,IF(AND(P58<37,M58>5),6,0))))))","v":0},88,"","","","","",{"$f":"IF(T58<>\"\",(LOOKUP(T58,Alterskategorie!$A$2:$A$110,Alterskategorie!$B$2:$B$110)),\"\")","v":""}]
["",null,null,null,null,{"$f":"IF(B59<>\"\",(LOOKUP(T59,Alterskategorie!$A$2:$A$110,Alterskategorie!$B$2:$B$110)),\"\")","v":""},null,null,null,{"$f":"IF(IF(P59=1,K59,IF(AND(K59<>0,D59=D58),J58+K59,0))>J$4,K59,IF(P59=1,K59,IF(AND(K59<>0,D59=D58),J58+K59,0)))","v":0},{"$f":"IF($P59<=M59*6,$G59,0)","v":0},null,{"$f":"IFERROR(LOOKUP($D59,SSV_Organisation[Vereinsname],SSV_Organisation[Grp.Dpp.]),0)","v":0},{"$f":"IF(AND(P59<7,M59>0),1,IF(AND(P59<13,M59>1),2,IF(AND(P59<19,M59>2),3,IF(AND(P59<25,M59>3),4,IF(AND(P59<31,M59>4),5,IF(AND(P59<37,M59>5),6,0))))))","v":0},87,"","","","","",{"$f":"IF(T59<>\"\",(LOOKUP(T59,Alterskategorie!$A$2:$A$110,Alterskategorie!$B$2:$B$110)),\"\")","v":""}]
["",null,null,null,null,{"$f":"IF(B60<>\"\",(LOOKUP(T60,Alterskategorie!$A$2:$A$110,Alterskategorie!$B$2:$B$110)),\"\")","v":""},null,null,null,{"$f":"IF(IF(P60=1,K60,IF(AND(K60<>0,D60=D59),J59+K60,0))>J$4,K60,IF(P60=1,K60,IF(AND(K60<>0,D60=D59),J59+K60,0)))","v":0},{"$f":"IF($P60<=M60*6,$G60,0)","v":0},null,{"$f":"IFERROR(LOOKUP($D60,SSV_Organisation[Vereinsname],SSV_Organisation[Grp.Dpp.]),0)","v":0},{"$f":"IF(AND(P60<7,M60>0),1,IF(AND(P60<13,M60>1),2,IF(AND(P60<19,M60>2),3,IF(AND(P60<25,M60>3),4,IF(AND(P60<31,M60>4),5,IF(AND(P60<37,M60>5),6,0))))))","v":0},848,"","","","","",{"$f":"IF(T60<>\"\",(LOOKUP(T60,Alterskategorie!$A$2:$A$110,Alterskategorie!$B$2:$B$110)),\"\")","v":""}]
["",null,null,null,null,{"$f":"IF(B61<>\"\",(LOOKUP(T61,Alterskategorie!$A$2:$A$110,Alterskategorie!$B$2:$B$110)),\"\")","v":""},null,null,null,{"$f":"IF(IF(P61=1,K61,IF(AND(K61<>0,D61=D60),J60+K61,0))>J$4,K61,IF(P61=1,K61,IF(AND(K61<>0,D61=D60),J60+K61,0)))","v":0},{"$f":"IF($P61<=M61*6,$G61,0)","v":0},null,{"$f":"IFERROR(LOOKUP($D61,SSV_Organisation[Vereinsname],SSV_Organisation[Grp.Dpp.]),0)","v":0},{"$f":"IF(AND(P61<7,M61>0),1,IF(AND(P61<13,M61>1),2,IF(AND(P61<19,M61>2),3,IF(AND(P61<25,M61>3),4,IF(AND(P61<31,M61>4),5,IF(AND(P61<37,M61>5),6,0))))))","v":0},550,"","","","","",{"$f":"IF(T61<>\"\",(LOOKUP(T61,Alterskategorie!$A$2:$A$110,Alterskategorie!$B$2:$B$110)),\"\")","v":""}]
["",null,null,null,null,{"$f":"IF(B62<>\"\",(LOOKUP(T62,Alterskategorie!$A$2:$A$110,Alterskategorie!$B$2:$B$110)),\"\")","v":""},null,null,null,{"$f":"IF(IF(P62=1,K62,IF(AND(K62<>0,D62=D61),J61+K62,0))>J$4,K62,IF(P62=1,K62,IF(AND(K62<>0,D62=D61),J61+K62,0)))","v":0},{"$f":"IF($P62<=M62*6,$G62,0)","v":0},null,{"$f":"IFERROR(LOOKUP($D62,SSV_Organisation[Vereinsname],SSV_Organisation[Grp.Dpp.]),0)","v":0},{"$f":"IF(AND(P62<7,M62>0),1,IF(AND(P62<13,M62>1),2,IF(AND(P62<19,M62>2),3,IF(AND(P62<25,M62>3),4,IF(AND(P62<31,M62>4),5,IF(AND(P62<37,M62>5),6,0))))))","v":0},89,"","","","","",{"$f":"IF(T62<>\"\",(LOOKUP(T62,Alterskategorie!$A$2:$A$110,Alterskategorie!$B$2:$B$110)),\"\")","v":""}]
["",null,null,null,null,{"$f":"IF(B63<>\"\",(LOOKUP(T63,Alterskategorie!$A$2:$A$110,Alterskategorie!$B$2:$B$110)),\"\")","v":""},null,null,null,{"$f":"IF(IF(P63=1,K63,IF(AND(K63<>0,D63=D62),J62+K63,0))>J$4,K63,IF(P63=1,K63,IF(AND(K63<>0,D63=D62),J62+K63,0)))","v":0},{"$f":"IF($P63<=M63*6,$G63,0)","v":0},null,{"$f":"IFERROR(LOOKUP($D63,SSV_Organisation[Vereinsname],SSV_Organisation[Grp.Dpp.]),0)","v":0},{"$f":"IF(AND(P63<7,M63>0),1,IF(AND(P63<13,M63>1),2,IF(AND(P63<19,M63>2),3,IF(AND(P63<25,M63>3),4,IF(AND(P63<31,M63>4),5,IF(AND(P63<37,M63>5),6,0))))))","v":0},864,"","","","","",{"$f":"IF(T63<>\"\",(LOOKUP(T63,Alterskategorie!$A$2:$A$110,Alterskategorie!$B$2:$B$110)),\"\")","v":""}]
["",null,null,null,null,{"$f":"IF(B64<>\"\",(LOOKUP(T64,Alterskategorie!$A$2:$A$110,Alterskategorie!$B$2:$B$110)),\"\")","v":""},null,null,null,{"$f":"IF(IF(P64=1,K64,IF(AND(K64<>0,D64=D63),J63+K64,0))>J$4,K64,IF(P64=1,K64,IF(AND(K64<>0,D64=D63),J63+K64,0)))","v":0},{"$f":"IF($P64<=M64*6,$G64,0)","v":0},null,{"$f":"IFERROR(LOOKUP($D64,SSV_Organisation[Vereinsname],SSV_Organisation[Grp.Dpp.]),0)","v":0},{"$f":"IF(AND(P64<7,M64>0),1,IF(AND(P64<13,M64>1),2,IF(AND(P64<19,M64>2),3,IF(AND(P64<25,M64>3),4,IF(AND(P64<31,M64>4),5,IF(AND(P64<37,M64>5),6,0))))))","v":0},215,"","","","","",{"$f":"IF(T64<>\"\",(LOOKUP(T64,Alterskategorie!$A$2:$A$110,Alterskategorie!$B$2:$B$110)),\"\")","v":""}]
["",null,null,null,null,{"$f":"IF(B65<>\"\",(LOOKUP(T65,Alterskategorie!$A$2:$A$110,Alterskategorie!$B$2:$B$110)),\"\")","v":""},null,null,null,{"$f":"IF(IF(P65=1,K65,IF(AND(K65<>0,D65=D64),J64+K65,0))>J$4,K65,IF(P65=1,K65,IF(AND(K65<>0,D65=D64),J64+K65,0)))","v":0},{"$f":"IF($P65<=M65*6,$G65,0)","v":0},null,{"$f":"IFERROR(LOOKUP($D65,SSV_Organisation[Vereinsname],SSV_Organisation[Grp.Dpp.]),0)","v":0},{"$f":"IF(AND(P65<7,M65>0),1,IF(AND(P65<13,M65>1),2,IF(AND(P65<19,M65>2),3,IF(AND(P65<25,M65>3),4,IF(AND(P65<31,M65>4),5,IF(AND(P65<37,M65>5),6,0))))))","v":0},557,"","","","","",{"$f":"IF(T65<>\"\",(LOOKUP(T65,Alterskategorie!$A$2:$A$110,Alterskategorie!$B$2:$B$110)),\"\")","v":""}]
["",null,null,null,null,{"$f":"IF(B66<>\"\",(LOOKUP(T66,Alterskategorie!$A$2:$A$110,Alterskategorie!$B$2:$B$110)),\"\")","v":""},null,null,null,{"$f":"IF(IF(P66=1,K66,IF(AND(K66<>0,D66=D65),J65+K66,0))>J$4,K66,IF(P66=1,K66,IF(AND(K66<>0,D66=D65),J65+K66,0)))","v":0},{"$f":"IF($P66<=M66*6,$G66,0)","v":0},null,{"$f":"IFERROR(LOOKUP($D66,SSV_Organisation[Vereinsname],SSV_Organisation[Grp.Dpp.]),0)","v":0},{"$f":"IF(AND(P66<7,M66>0),1,IF(AND(P66<13,M66>1),2,IF(AND(P66<19,M66>2),3,IF(AND(P66<25,M66>3),4,IF(AND(P66<31,M66>4),5,IF(AND(P66<37,M66>5),6,0))))))","v":0},561,"","","","","",{"$f":"IF(T66<>\"\",(LOOKUP(T66,Alterskategorie!$A$2:$A$110,Alterskategorie!$B$2:$B$110)),\"\")","v":""}]
["",null,null,null,null,{"$f":"IF(B67<>\"\",(LOOKUP(T67,Alterskategorie!$A$2:$A$110,Alterskategorie!$B$2:$B$110)),\"\")","v":""},null,null,null,{"$f":"IF(IF(P67=1,K67,IF(AND(K67<>0,D67=D66),J66+K67,0))>J$4,K67,IF(P67=1,K67,IF(AND(K67<>0,D67=D66),J66+K67,0)))","v":0},{"$f":"IF($P67<=M67*6,$G67,0)","v":0},null,{"$f":"IFERROR(LOOKUP($D67,SSV_Organisation[Vereinsname],SSV_Organisation[Grp.Dpp.]),0)","v":0},{"$f":"IF(AND(P67<7,M67>0),1,IF(AND(P67<13,M67>1),2,IF(AND(P67<19,M67>2),3,IF(AND(P67<25,M67>3),4,IF(AND(P67<31,M67>4),5,IF(AND(P67<37,M67>5),6,0))))))","v":0},866,"","","","","",{"$f":"IF(T67<>\"\",(LOOKUP(T67,Alterskategorie!$A$2:$A$110,Alterskategorie!$B$2:$B$110)),\"\")","v":""}]
["",null,null,null,null,{"$f":"IF(B68<>\"\",(LOOKUP(T68,Alterskategorie!$A$2:$A$110,Alterskategorie!$B$2:$B$110)),\"\")","v":""},null,null,null,{"$f":"IF(IF(P68=1,K68,IF(AND(K68<>0,D68=D67),J67+K68,0))>J$4,K68,IF(P68=1,K68,IF(AND(K68<>0,D68=D67),J67+K68,0)))","v":0},{"$f":"IF($P68<=M68*6,$G68,0)","v":0},null,{"$f":"IFERROR(LOOKUP($D68,SSV_Organisation[Vereinsname],SSV_Organisation[Grp.Dpp.]),0)","v":0},{"$f":"IF(AND(P68<7,M68>0),1,IF(AND(P68<13,M68>1),2,IF(AND(P68<19,M68>2),3,IF(AND(P68<25,M68>3),4,IF(AND(P68<31,M68>4),5,IF(AND(P68<37,M68>5),6,0))))))","v":0},90,"","","","","",{"$f":"IF(T68<>\"\",(LOOKUP(T68,Alterskategorie!$A$2:$A$110,Alterskategorie!$B$2:$B$110)),\"\")","v":""}]
["",null,null,null,null,{"$f":"IF(B69<>\"\",(LOOKUP(T69,Alterskategorie!$A$2:$A$110,Alterskategorie!$B$2:$B$110)),\"\")","v":""},null,null,null,{"$f":"IF(IF(P69=1,K69,IF(AND(K69<>0,D69=D68),J68+K69,0))>J$4,K69,IF(P69=1,K69,IF(AND(K69<>0,D69=D68),J68+K69,0)))","v":0},{"$f":"IF($P69<=M69*6,$G69,0)","v":0},null,{"$f":"IFERROR(LOOKUP($D69,SSV_Organisation[Vereinsname],SSV_Organisation[Grp.Dpp.]),0)","v":0},{"$f":"IF(AND(P69<7,M69>0),1,IF(AND(P69<13,M69>1),2,IF(AND(P69<19,M69>2),3,IF(AND(P69<25,M69>3),4,IF(AND(P69<31,M69>4),5,IF(AND(P69<37,M69>5),6,0))))))","v":0},562,"","","","","",{"$f":"IF(T69<>\"\",(LOOKUP(T69,Alterskategorie!$A$2:$A$110,Alterskategorie!$B$2:$B$110)),\"\")","v":""}]
["",null,null,null,null,{"$f":"IF(B70<>\"\",(LOOKUP(T70,Alterskategorie!$A$2:$A$110,Alterskategorie!$B$2:$B$110)),\"\")","v":""},null,null,null,{"$f":"IF(IF(P70=1,K70,IF(AND(K70<>0,D70=D69),J69+K70,0))>J$4,K70,IF(P70=1,K70,IF(AND(K70<>0,D70=D69),J69+K70,0)))","v":0},{"$f":"IF($P70<=M70*6,$G70,0)","v":0},null,{"$f":"IFERROR(LOOKUP($D70,SSV_Organisation[Vereinsname],SSV_Organisation[Grp.Dpp.]),0)","v":0},{"$f":"IF(AND(P70<7,M70>0),1,IF(AND(P70<13,M70>1),2,IF(AND(P70<19,M70>2),3,IF(AND(P70<25,M70>3),4,IF(AND(P70<31,M70>4),5,IF(AND(P70<37,M70>5),6,0))))))","v":0},216,"","","","","",{"$f":"IF(T70<>\"\",(LOOKUP(T70,Alterskategorie!$A$2:$A$110,Alterskategorie!$B$2:$B$110)),\"\")","v":""}]
["",null,null,null,null,{"$f":"IF(B71<>\"\",(LOOKUP(T71,Alterskategorie!$A$2:$A$110,Alterskategorie!$B$2:$B$110)),\"\")","v":""},null,null,null,{"$f":"IF(IF(P71=1,K71,IF(AND(K71<>0,D71=D70),J70+K71,0))>J$4,K71,IF(P71=1,K71,IF(AND(K71<>0,D71=D70),J70+K71,0)))","v":0},{"$f":"IF($P71<=M71*6,$G71,0)","v":0},null,{"$f":"IFERROR(LOOKUP($D71,SSV_Organisation[Vereinsname],SSV_Organisation[Grp.Dpp.]),0)","v":0},{"$f":"IF(AND(P71<7,M71>0),1,IF(AND(P71<13,M71>1),2,IF(AND(P71<19,M71>2),3,IF(AND(P71<25,M71>3),4,IF(AND(P71<31,M71>4),5,IF(AND(P71<37,M71>5),6,0))))))","v":0},92,"","","","","",{"$f":"IF(T71<>\"\",(LOOKUP(T71,Alterskategorie!$A$2:$A$110,Alterskategorie!$B$2:$B$110)),\"\")","v":""}]
["",null,null,null,null,{"$f":"IF(B72<>\"\",(LOOKUP(T72,Alterskategorie!$A$2:$A$110,Alterskategorie!$B$2:$B$110)),\"\")","v":""},null,null,null,{"$f":"IF(IF(P72=1,K72,IF(AND(K72<>0,D72=D71),J71+K72,0))>J$4,K72,IF(P72=1,K72,IF(AND(K72<>0,D72=D71),J71+K72,0)))","v":0},{"$f":"IF($P72<=M72*6,$G72,0)","v":0},null,{"$f":"IFERROR(LOOKUP($D72,SSV_Organisation[Vereinsname],SSV_Organisation[Grp.Dpp.]),0)","v":0},{"$f":"IF(AND(P72<7,M72>0),1,IF(AND(P72<13,M72>1),2,IF(AND(P72<19,M72>2),3,IF(AND(P72<25,M72>3),4,IF(AND(P72<31,M72>4),5,IF(AND(P72<37,M72>5),6,0))))))","v":0},849,"","","","","",{"$f":"IF(T72<>\"\",(LOOKUP(T72,Alterskategorie!$A$2:$A$110,Alterskategorie!$B$2:$B$110)),\"\")","v":""}]
["",null,null,null,null,{"$f":"IF(B73<>\"\",(LOOKUP(T73,Alterskategorie!$A$2:$A$110,Alterskategorie!$B$2:$B$110)),\"\")","v":""},null,null,null,{"$f":"IF(IF(P73=1,K73,IF(AND(K73<>0,D73=D72),J72+K73,0))>J$4,K73,IF(P73=1,K73,IF(AND(K73<>0,D73=D72),J72+K73,0)))","v":0},{"$f":"IF($P73<=M73*6,$G73,0)","v":0},null,{"$f":"IFERROR(LOOKUP($D73,SSV_Organisation[Vereinsname],SSV_Organisation[Grp.Dpp.]),0)","v":0},{"$f":"IF(AND(P73<7,M73>0),1,IF(AND(P73<13,M73>1),2,IF(AND(P73<19,M73>2),3,IF(AND(P73<25,M73>3),4,IF(AND(P73<31,M73>4),5,IF(AND(P73<37,M73>5),6,0))))))","v":0},868,"","","","","",{"$f":"IF(T73<>\"\",(LOOKUP(T73,Alterskategorie!$A$2:$A$110,Alterskategorie!$B$2:$B$110)),\"\")","v":""}]
[{"$f":"IF(B74>\"\",A73+1,\"\")","v":""},null,null,null,null,{"$f":"IF(B74<>\"\",(LOOKUP(T74,Alterskategorie!$A$2:$A$110,Alterskategorie!$B$2:$B$110)),\"\")","v":""},null,null,null,{"$f":"IF(IF(P74=1,K74,IF(AND(K74<>0,D74=D73),J73+K74,0))>J$4,K74,IF(P74=1,K74,IF(AND(K74<>0,D74=D73),J73+K74,0)))","v":0},{"$f":"IF($P74<=M74*6,$G74,0)","v":0},null,{"$f":"IFERROR(LOOKUP($D74,SSV_Organisation[Vereinsname],SSV_Organisation[Grp.Dpp.]),0)","v":0},{"$f":"IF(AND(P74<7,M74>0),1,IF(AND(P74<13,M74>1),2,IF(AND(P74<19,M74>2),3,IF(AND(P74<25,M74>3),4,IF(AND(P74<31,M74>4),5,IF(AND(P74<37,M74>5),6,0))))))","v":0},567,"",{"$f":"IF(AND($M74>0,$D74<>$D75),D74,IF(OR($P74=6,$P74=12,$P74=18,$P74=24,$P74=30,$P74=36,$P74=42,$P74=48,$P74=54,$P74=60,$P74=66,$P74=72,$P74=78,$P74=84,$P74=90,$P74=96),$D74,\"\"))","v":""},"",{"$f":"IF(Q74<>\"\",SUM(J74),\"\")","v":""},{"$f":"IF(ISBLANK(E74),\"\",$N$5-E74)","v":""},{"$f":"IF(T74<>\"\",(LOOKUP(T74,Alterskategorie!$A$2:$A$110,Alterskategorie!$B$2:$B$110)),\"\")","v":""}]
["",null,null,null,null,{"$f":"IF(B75<>\"\",(LOOKUP(T75,Alterskategorie!$A$2:$A$110,Alterskategorie!$B$2:$B$110)),\"\")","v":""},null,null,null,{"$f":"IF(IF(P75=1,K75,IF(AND(K75<>0,D75=D74),J74+K75,0))>J$4,K75,IF(P75=1,K75,IF(AND(K75<>0,D75=D74),J74+K75,0)))","v":0},{"$f":"IF($P75<=M75*6,$G75,0)","v":0},null,{"$f":"IFERROR(LOOKUP($D75,SSV_Organisation[Vereinsname],SSV_Organisation[Grp.Dpp.]),0)","v":0},{"$f":"IF(AND(P75<7,M75>0),1,IF(AND(P75<13,M75>1),2,IF(AND(P75<19,M75>2),3,IF(AND(P75<25,M75>3),4,IF(AND(P75<31,M75>4),5,IF(AND(P75<37,M75>5),6,0))))))","v":0},563,{"$f":"IF(ISBLANK($D75),\"\",IF($D75=$D74,$P74+1,1))","v":""},"",{"$f":"IF(AND($M75>0,$D75<>$D76),$D75,\"\")","v":""},"","",{"$f":"IF(T75<>\"\",(LOOKUP(T75,Alterskategorie!$A$2:$A$110,Alterskategorie!$B$2:$B$110)),\"\")","v":""}]
["",null,null,null,null,{"$f":"IF(B76<>\"\",(LOOKUP(T76,Alterskategorie!$A$2:$A$110,Alterskategorie!$B$2:$B$110)),\"\")","v":""},null,null,null,{"$f":"IF(IF(P76=1,K76,IF(AND(K76<>0,D76=D75),J75+K76,0))>J$4,K76,IF(P76=1,K76,IF(AND(K76<>0,D76=D75),J75+K76,0)))","v":0},{"$f":"IF($P76<=M76*6,$G76,0)","v":0},null,{"$f":"IFERROR(LOOKUP($D76,SSV_Organisation[Vereinsname],SSV_Organisation[Grp.Dpp.]),0)","v":0},{"$f":"IF(AND(P76<7,M76>0),1,IF(AND(P76<13,M76>1),2,IF(AND(P76<19,M76>2),3,IF(AND(P76<25,M76>3),4,IF(AND(P76<31,M76>4),5,IF(AND(P76<37,M76>5),6,0))))))","v":0},93,"","","","","",{"$f":"IF(T76<>\"\",(LOOKUP(T76,Alterskategorie!$A$2:$A$110,Alterskategorie!$B$2:$B$110)),\"\")","v":""}]
["",null,null,null,null,{"$f":"IF(B77<>\"\",(LOOKUP(T77,Alterskategorie!$A$2:$A$110,Alterskategorie!$B$2:$B$110)),\"\")","v":""},null,null,null,{"$f":"IF(IF(P77=1,K77,IF(AND(K77<>0,D77=D76),J76+K77,0))>J$4,K77,IF(P77=1,K77,IF(AND(K77<>0,D77=D76),J76+K77,0)))","v":0},{"$f":"IF($P77<=M77*6,$G77,0)","v":0},null,{"$f":"IFERROR(LOOKUP($D77,SSV_Organisation[Vereinsname],SSV_Organisation[Grp.Dpp.]),0)","v":0},{"$f":"IF(AND(P77<7,M77>0),1,IF(AND(P77<13,M77>1),2,IF(AND(P77<19,M77>2),3,IF(AND(P77<25,M77>3),4,IF(AND(P77<31,M77>4),5,IF(AND(P77<37,M77>5),6,0))))))","v":0},875,"","","","","",{"$f":"IF(T77<>\"\",(LOOKUP(T77,Alterskategorie!$A$2:$A$110,Alterskategorie!$B$2:$B$110)),\"\")","v":""}]
["",null,null,null,null,{"$f":"IF(B78<>\"\",(LOOKUP(T78,Alterskategorie!$A$2:$A$110,Alterskategorie!$B$2:$B$110)),\"\")","v":""},null,null,null,{"$f":"IF(IF(P78=1,K78,IF(AND(K78<>0,D78=D77),J77+K78,0))>J$4,K78,IF(P78=1,K78,IF(AND(K78<>0,D78=D77),J77+K78,0)))","v":0},{"$f":"IF($P78<=M78*6,$G78,0)","v":0},null,{"$f":"IFERROR(LOOKUP($D78,SSV_Organisation[Vereinsname],SSV_Organisation[Grp.Dpp.]),0)","v":0},{"$f":"IF(AND(P78<7,M78>0),1,IF(AND(P78<13,M78>1),2,IF(AND(P78<19,M78>2),3,IF(AND(P78<25,M78>3),4,IF(AND(P78<31,M78>4),5,IF(AND(P78<37,M78>5),6,0))))))","v":0},94,"","","","","",{"$f":"IF(T78<>\"\",(LOOKUP(T78,Alterskategorie!$A$2:$A$110,Alterskategorie!$B$2:$B$110)),\"\")","v":""}]
["",null,null,null,null,{"$f":"IF(B79<>\"\",(LOOKUP(T79,Alterskategorie!$A$2:$A$110,Alterskategorie!$B$2:$B$110)),\"\")","v":""},null,null,null,{"$f":"IF(IF(P79=1,K79,IF(AND(K79<>0,D79=D78),J78+K79,0))>J$4,K79,IF(P79=1,K79,IF(AND(K79<>0,D79=D78),J78+K79,0)))","v":0},{"$f":"IF($P79<=M79*6,$G79,0)","v":0},null,{"$f":"IFERROR(LOOKUP($D79,SSV_Organisation[Vereinsname],SSV_Organisation[Grp.Dpp.]),0)","v":0},{"$f":"IF(AND(P79<7,M79>0),1,IF(AND(P79<13,M79>1),2,IF(AND(P79<19,M79>2),3,IF(AND(P79<25,M79>3),4,IF(AND(P79<31,M79>4),5,IF(AND(P79<37,M79>5),6,0))))))","v":0},95,"","","","","",{"$f":"IF(T79<>\"\",(LOOKUP(T79,Alterskategorie!$A$2:$A$110,Alterskategorie!$B$2:$B$110)),\"\")","v":""}]
["",null,null,null,null,{"$f":"IF(B80<>\"\",(LOOKUP(T80,Alterskategorie!$A$2:$A$110,Alterskategorie!$B$2:$B$110)),\"\")","v":""},null,null,null,{"$f":"IF(IF(P80=1,K80,IF(AND(K80<>0,D80=D79),J79+K80,0))>J$4,K80,IF(P80=1,K80,IF(AND(K80<>0,D80=D79),J79+K80,0)))","v":0},{"$f":"IF($P80<=M80*6,$G80,0)","v":0},null,{"$f":"IFERROR(LOOKUP($D80,SSV_Organisation[Vereinsname],SSV_Organisation[Grp.Dpp.]),0)","v":0},{"$f":"IF(AND(P80<7,M80>0),1,IF(AND(P80<13,M80>1),2,IF(AND(P80<19,M80>2),3,IF(AND(P80<25,M80>3),4,IF(AND(P80<31,M80>4),5,IF(AND(P80<37,M80>5),6,0))))))","v":0},568,"","","","","",{"$f":"IF(T80<>\"\",(LOOKUP(T80,Alterskategorie!$A$2:$A$110,Alterskategorie!$B$2:$B$110)),\"\")","v":""}]
["",null,null,null,null,{"$f":"IF(B81<>\"\",(LOOKUP(T81,Alterskategorie!$A$2:$A$110,Alterskategorie!$B$2:$B$110)),\"\")","v":""},null,null,null,{"$f":"IF(IF(P81=1,K81,IF(AND(K81<>0,D81=D80),J80+K81,0))>J$4,K81,IF(P81=1,K81,IF(AND(K81<>0,D81=D80),J80+K81,0)))","v":0},{"$f":"IF($P81<=M81*6,$G81,0)","v":0},null,{"$f":"IFERROR(LOOKUP($D81,SSV_Organisation[Vereinsname],SSV_Organisation[Grp.Dpp.]),0)","v":0},{"$f":"IF(AND(P81<7,M81>0),1,IF(AND(P81<13,M81>1),2,IF(AND(P81<19,M81>2),3,IF(AND(P81<25,M81>3),4,IF(AND(P81<31,M81>4),5,IF(AND(P81<37,M81>5),6,0))))))","v":0},878,"","","","","",{"$f":"IF(T81<>\"\",(LOOKUP(T81,Alterskategorie!$A$2:$A$110,Alterskategorie!$B$2:$B$110)),\"\")","v":""}]
["",null,null,null,null,{"$f":"IF(B82<>\"\",(LOOKUP(T82,Alterskategorie!$A$2:$A$110,Alterskategorie!$B$2:$B$110)),\"\")","v":""},null,null,null,{"$f":"IF(IF(P82=1,K82,IF(AND(K82<>0,D82=D81),J81+K82,0))>J$4,K82,IF(P82=1,K82,IF(AND(K82<>0,D82=D81),J81+K82,0)))","v":0},{"$f":"IF($P82<=M82*6,$G82,0)","v":0},null,{"$f":"IFERROR(LOOKUP($D82,SSV_Organisation[Vereinsname],SSV_Organisation[Grp.Dpp.]),0)","v":0},{"$f":"IF(AND(P82<7,M82>0),1,IF(AND(P82<13,M82>1),2,IF(AND(P82<19,M82>2),3,IF(AND(P82<25,M82>3),4,IF(AND(P82<31,M82>4),5,IF(AND(P82<37,M82>5),6,0))))))","v":0},879,"","","","","",{"$f":"IF(T82<>\"\",(LOOKUP(T82,Alterskategorie!$A$2:$A$110,Alterskategorie!$B$2:$B$110)),\"\")","v":""}]
["",null,null,null,null,{"$f":"IF(B83<>\"\",(LOOKUP(T83,Alterskategorie!$A$2:$A$110,Alterskategorie!$B$2:$B$110)),\"\")","v":""},null,null,null,{"$f":"IF(IF(P83=1,K83,IF(AND(K83<>0,D83=D82),J82+K83,0))>J$4,K83,IF(P83=1,K83,IF(AND(K83<>0,D83=D82),J82+K83,0)))","v":0},{"$f":"IF($P83<=M83*6,$G83,0)","v":0},null,{"$f":"IFERROR(LOOKUP($D83,SSV_Organisation[Vereinsname],SSV_Organisation[Grp.Dpp.]),0)","v":0},{"$f":"IF(AND(P83<7,M83>0),1,IF(AND(P83<13,M83>1),2,IF(AND(P83<19,M83>2),3,IF(AND(P83<25,M83>3),4,IF(AND(P83<31,M83>4),5,IF(AND(P83<37,M83>5),6,0))))))","v":0},880,"","","","","",{"$f":"IF(T83<>\"\",(LOOKUP(T83,Alterskategorie!$A$2:$A$110,Alterskategorie!$B$2:$B$110)),\"\")","v":""}]
["",null,null,null,null,{"$f":"IF(B84<>\"\",(LOOKUP(T84,Alterskategorie!$A$2:$A$110,Alterskategorie!$B$2:$B$110)),\"\")","v":""},null,null,null,{"$f":"IF(IF(P84=1,K84,IF(AND(K84<>0,D84=D83),J83+K84,0))>J$4,K84,IF(P84=1,K84,IF(AND(K84<>0,D84=D83),J83+K84,0)))","v":0},{"$f":"IF($P84<=M84*6,$G84,0)","v":0},null,{"$f":"IFERROR(LOOKUP($D84,SSV_Organisation[Vereinsname],SSV_Organisation[Grp.Dpp.]),0)","v":0},{"$f":"IF(AND(P84<7,M84>0),1,IF(AND(P84<13,M84>1),2,IF(AND(P84<19,M84>2),3,IF(AND(P84<25,M84>3),4,IF(AND(P84<31,M84>4),5,IF(AND(P84<37,M84>5),6,0))))))","v":0},853,"","","","","",{"$f":"IF(T84<>\"\",(LOOKUP(T84,Alterskategorie!$A$2:$A$110,Alterskategorie!$B$2:$B$110)),\"\")","v":""}]
["",null,null,null,null,{"$f":"IF(B85<>\"\",(LOOKUP(T85,Alterskategorie!$A$2:$A$110,Alterskategorie!$B$2:$B$110)),\"\")","v":""},null,null,null,{"$f":"IF(IF(P85=1,K85,IF(AND(K85<>0,D85=D84),J84+K85,0))>J$4,K85,IF(P85=1,K85,IF(AND(K85<>0,D85=D84),J84+K85,0)))","v":0},{"$f":"IF($P85<=M85*6,$G85,0)","v":0},null,{"$f":"IFERROR(LOOKUP($D85,SSV_Organisation[Vereinsname],SSV_Organisation[Grp.Dpp.]),0)","v":0},{"$f":"IF(AND(P85<7,M85>0),1,IF(AND(P85<13,M85>1),2,IF(AND(P85<19,M85>2),3,IF(AND(P85<25,M85>3),4,IF(AND(P85<31,M85>4),5,IF(AND(P85<37,M85>5),6,0))))))","v":0},881,"","","","","",{"$f":"IF(T85<>\"\",(LOOKUP(T85,Alterskategorie!$A$2:$A$110,Alterskategorie!$B$2:$B$110)),\"\")","v":""}]
["",null,null,null,null,{"$f":"IF(B86<>\"\",(LOOKUP(T86,Alterskategorie!$A$2:$A$110,Alterskategorie!$B$2:$B$110)),\"\")","v":""},null,null,null,{"$f":"IF(IF(P86=1,K86,IF(AND(K86<>0,D86=D85),J85+K86,0))>J$4,K86,IF(P86=1,K86,IF(AND(K86<>0,D86=D85),J85+K86,0)))","v":0},{"$f":"IF($P86<=M86*6,$G86,0)","v":0},null,{"$f":"IFERROR(LOOKUP($D86,SSV_Organisation[Vereinsname],SSV_Organisation[Grp.Dpp.]),0)","v":0},{"$f":"IF(AND(P86<7,M86>0),1,IF(AND(P86<13,M86>1),2,IF(AND(P86<19,M86>2),3,IF(AND(P86<25,M86>3),4,IF(AND(P86<31,M86>4),5,IF(AND(P86<37,M86>5),6,0))))))","v":0},570,"","","","","",{"$f":"IF(T86<>\"\",(LOOKUP(T86,Alterskategorie!$A$2:$A$110,Alterskategorie!$B$2:$B$110)),\"\")","v":""}]
["",null,null,null,null,{"$f":"IF(B87<>\"\",(LOOKUP(T87,Alterskategorie!$A$2:$A$110,Alterskategorie!$B$2:$B$110)),\"\")","v":""},null,null,null,{"$f":"IF(IF(P87=1,K87,IF(AND(K87<>0,D87=D86),J86+K87,0))>J$4,K87,IF(P87=1,K87,IF(AND(K87<>0,D87=D86),J86+K87,0)))","v":0},{"$f":"IF($P87<=M87*6,$G87,0)","v":0},null,{"$f":"IFERROR(LOOKUP($D87,SSV_Organisation[Vereinsname],SSV_Organisation[Grp.Dpp.]),0)","v":0},{"$f":"IF(AND(P87<7,M87>0),1,IF(AND(P87<13,M87>1),2,IF(AND(P87<19,M87>2),3,IF(AND(P87<25,M87>3),4,IF(AND(P87<31,M87>4),5,IF(AND(P87<37,M87>5),6,0))))))","v":0},96,"","","","","",{"$f":"IF(T87<>\"\",(LOOKUP(T87,Alterskategorie!$A$2:$A$110,Alterskategorie!$B$2:$B$110)),\"\")","v":""}]
["",null,null,null,null,{"$f":"IF(B88<>\"\",(LOOKUP(T88,Alterskategorie!$A$2:$A$110,Alterskategorie!$B$2:$B$110)),\"\")","v":""},null,null,null,{"$f":"IF(IF(P88=1,K88,IF(AND(K88<>0,D88=D87),J87+K88,0))>J$4,K88,IF(P88=1,K88,IF(AND(K88<>0,D88=D87),J87+K88,0)))","v":0},{"$f":"IF($P88<=M88*6,$G88,0)","v":0},null,{"$f":"IFERROR(LOOKUP($D88,SSV_Organisation[Vereinsname],SSV_Organisation[Grp.Dpp.]),0)","v":0},{"$f":"IF(AND(P88<7,M88>0),1,IF(AND(P88<13,M88>1),2,IF(AND(P88<19,M88>2),3,IF(AND(P88<25,M88>3),4,IF(AND(P88<31,M88>4),5,IF(AND(P88<37,M88>5),6,0))))))","v":0},909,"","","","","",{"$f":"IF(T88<>\"\",(LOOKUP(T88,Alterskategorie!$A$2:$A$110,Alterskategorie!$B$2:$B$110)),\"\")","v":""}]
["",null,null,null,null,{"$f":"IF(B89<>\"\",(LOOKUP(T89,Alterskategorie!$A$2:$A$110,Alterskategorie!$B$2:$B$110)),\"\")","v":""},null,null,null,{"$f":"IF(IF(P89=1,K89,IF(AND(K89<>0,D89=D88),J88+K89,0))>J$4,K89,IF(P89=1,K89,IF(AND(K89<>0,D89=D88),J88+K89,0)))","v":0},{"$f":"IF($P89<=M89*6,$G89,0)","v":0},null,{"$f":"IFERROR(LOOKUP($D89,SSV_Organisation[Vereinsname],SSV_Organisation[Grp.Dpp.]),0)","v":0},{"$f":"IF(AND(P89<7,M89>0),1,IF(AND(P89<13,M89>1),2,IF(AND(P89<19,M89>2),3,IF(AND(P89<25,M89>3),4,IF(AND(P89<31,M89>4),5,IF(AND(P89<37,M89>5),6,0))))))","v":0},97,"","","","","",{"$f":"IF(T89<>\"\",(LOOKUP(T89,Alterskategorie!$A$2:$A$110,Alterskategorie!$B$2:$B$110)),\"\")","v":""}]
["",null,null,null,null,{"$f":"IF(B90<>\"\",(LOOKUP(T90,Alterskategorie!$A$2:$A$110,Alterskategorie!$B$2:$B$110)),\"\")","v":""},null,null,null,{"$f":"IF(IF(P90=1,K90,IF(AND(K90<>0,D90=D89),J89+K90,0))>J$4,K90,IF(P90=1,K90,IF(AND(K90<>0,D90=D89),J89+K90,0)))","v":0},{"$f":"IF($P90<=M90*6,$G90,0)","v":0},null,{"$f":"IFERROR(LOOKUP($D90,SSV_Organisation[Vereinsname],SSV_Organisation[Grp.Dpp.]),0)","v":0},{"$f":"IF(AND(P90<7,M90>0),1,IF(AND(P90<13,M90>1),2,IF(AND(P90<19,M90>2),3,IF(AND(P90<25,M90>3),4,IF(AND(P90<31,M90>4),5,IF(AND(P90<37,M90>5),6,0))))))","v":0},217,"","","","","",{"$f":"IF(T90<>\"\",(LOOKUP(T90,Alterskategorie!$A$2:$A$110,Alterskategorie!$B$2:$B$110)),\"\")","v":""}]
["",null,null,null,null,{"$f":"IF(B91<>\"\",(LOOKUP(T91,Alterskategorie!$A$2:$A$110,Alterskategorie!$B$2:$B$110)),\"\")","v":""},null,null,null,{"$f":"IF(IF(P91=1,K91,IF(AND(K91<>0,D91=D90),J90+K91,0))>J$4,K91,IF(P91=1,K91,IF(AND(K91<>0,D91=D90),J90+K91,0)))","v":0},{"$f":"IF($P91<=M91*6,$G91,0)","v":0},null,{"$f":"IFERROR(LOOKUP($D91,SSV_Organisation[Vereinsname],SSV_Organisation[Grp.Dpp.]),0)","v":0},{"$f":"IF(AND(P91<7,M91>0),1,IF(AND(P91<13,M91>1),2,IF(AND(P91<19,M91>2),3,IF(AND(P91<25,M91>3),4,IF(AND(P91<31,M91>4),5,IF(AND(P91<37,M91>5),6,0))))))","v":0},638,"","","","","",{"$f":"IF(T91<>\"\",(LOOKUP(T91,Alterskategorie!$A$2:$A$110,Alterskategorie!$B$2:$B$110)),\"\")","v":""}]
["",null,null,null,null,{"$f":"IF(B92<>\"\",(LOOKUP(T92,Alterskategorie!$A$2:$A$110,Alterskategorie!$B$2:$B$110)),\"\")","v":""},null,null,null,{"$f":"IF(IF(P92=1,K92,IF(AND(K92<>0,D92=D91),J91+K92,0))>J$4,K92,IF(P92=1,K92,IF(AND(K92<>0,D92=D91),J91+K92,0)))","v":0},{"$f":"IF($P92<=M92*6,$G92,0)","v":0},null,{"$f":"IFERROR(LOOKUP($D92,SSV_Organisation[Vereinsname],SSV_Organisation[Grp.Dpp.]),0)","v":0},{"$f":"IF(AND(P92<7,M92>0),1,IF(AND(P92<13,M92>1),2,IF(AND(P92<19,M92>2),3,IF(AND(P92<25,M92>3),4,IF(AND(P92<31,M92>4),5,IF(AND(P92<37,M92>5),6,0))))))","v":0},null,"","","","","",{"$f":"IF(T92<>\"\",(LOOKUP(T92,Alterskategorie!$A$2:$A$110,Alterskategorie!$B$2:$B$110)),\"\")","v":""}]
["",null,null,null,null,{"$f":"IF(B93<>\"\",(LOOKUP(T93,Alterskategorie!$A$2:$A$110,Alterskategorie!$B$2:$B$110)),\"\")","v":""},null,null,null,{"$f":"IF(IF(P93=1,K93,IF(AND(K93<>0,D93=D92),J92+K93,0))>J$4,K93,IF(P93=1,K93,IF(AND(K93<>0,D93=D92),J92+K93,0)))","v":0},{"$f":"IF($P93<=M93*6,$G93,0)","v":0},null,{"$f":"IFERROR(LOOKUP($D93,SSV_Organisation[Vereinsname],SSV_Organisation[Grp.Dpp.]),0)","v":0},{"$f":"IF(AND(P93<7,M93>0),1,IF(AND(P93<13,M93>1),2,IF(AND(P93<19,M93>2),3,IF(AND(P93<25,M93>3),4,IF(AND(P93<31,M93>4),5,IF(AND(P93<37,M93>5),6,0))))))","v":0},null,"","","","","",{"$f":"IF(T93<>\"\",(LOOKUP(T93,Alterskategorie!$A$2:$A$110,Alterskategorie!$B$2:$B$110)),\"\")","v":""}]
["",null,null,null,null,{"$f":"IF(B94<>\"\",(LOOKUP(T94,Alterskategorie!$A$2:$A$110,Alterskategorie!$B$2:$B$110)),\"\")","v":""},null,null,null,{"$f":"IF(IF(P94=1,K94,IF(AND(K94<>0,D94=D93),J93+K94,0))>J$4,K94,IF(P94=1,K94,IF(AND(K94<>0,D94=D93),J93+K94,0)))","v":0},{"$f":"IF($P94<=M94*6,$G94,0)","v":0},null,{"$f":"IFERROR(LOOKUP($D94,SSV_Organisation[Vereinsname],SSV_Organisation[Grp.Dpp.]),0)","v":0},{"$f":"IF(AND(P94<7,M94>0),1,IF(AND(P94<13,M94>1),2,IF(AND(P94<19,M94>2),3,IF(AND(P94<25,M94>3),4,IF(AND(P94<31,M94>4),5,IF(AND(P94<37,M94>5),6,0))))))","v":0},null,"","","","","",{"$f":"IF(T94<>\"\",(LOOKUP(T94,Alterskategorie!$A$2:$A$110,Alterskategorie!$B$2:$B$110)),\"\")","v":""}]
["",null,null,null,null,{"$f":"IF(B95<>\"\",(LOOKUP(T95,Alterskategorie!$A$2:$A$110,Alterskategorie!$B$2:$B$110)),\"\")","v":""},null,null,null,{"$f":"IF(IF(P95=1,K95,IF(AND(K95<>0,D95=D94),J94+K95,0))>J$4,K95,IF(P95=1,K95,IF(AND(K95<>0,D95=D94),J94+K95,0)))","v":0},{"$f":"IF($P95<=M95*6,$G95,0)","v":0},null,{"$f":"IFERROR(LOOKUP($D95,SSV_Organisation[Vereinsname],SSV_Organisation[Grp.Dpp.]),0)","v":0},{"$f":"IF(AND(P95<7,M95>0),1,IF(AND(P95<13,M95>1),2,IF(AND(P95<19,M95>2),3,IF(AND(P95<25,M95>3),4,IF(AND(P95<31,M95>4),5,IF(AND(P95<37,M95>5),6,0))))))","v":0},null,"","","","","",{"$f":"IF(T95<>\"\",(LOOKUP(T95,Alterskategorie!$A$2:$A$110,Alterskategorie!$B$2:$B$110)),\"\")","v":""}]
["",null,null,null,null,{"$f":"IF(B96<>\"\",(LOOKUP(T96,Alterskategorie!$A$2:$A$110,Alterskategorie!$B$2:$B$110)),\"\")","v":""},null,null,null,{"$f":"IF(IF(P96=1,K96,IF(AND(K96<>0,D96=D95),J95+K96,0))>J$4,K96,IF(P96=1,K96,IF(AND(K96<>0,D96=D95),J95+K96,0)))","v":0},{"$f":"IF($P96<=M96*6,$G96,0)","v":0},null,{"$f":"IFERROR(LOOKUP($D96,SSV_Organisation[Vereinsname],SSV_Organisation[Grp.Dpp.]),0)","v":0},{"$f":"IF(AND(P96<7,M96>0),1,IF(AND(P96<13,M96>1),2,IF(AND(P96<19,M96>2),3,IF(AND(P96<25,M96>3),4,IF(AND(P96<31,M96>4),5,IF(AND(P96<37,M96>5),6,0))))))","v":0},null,"","","","","",{"$f":"IF(T96<>\"\",(LOOKUP(T96,Alterskategorie!$A$2:$A$110,Alterskategorie!$B$2:$B$110)),\"\")","v":""}]
["",null,null,null,null,{"$f":"IF(B97<>\"\",(LOOKUP(T97,Alterskategorie!$A$2:$A$110,Alterskategorie!$B$2:$B$110)),\"\")","v":""},null,null,null,{"$f":"IF(IF(P97=1,K97,IF(AND(K97<>0,D97=D96),J96+K97,0))>J$4,K97,IF(P97=1,K97,IF(AND(K97<>0,D97=D96),J96+K97,0)))","v":0},{"$f":"IF($P97<=M97*6,$G97,0)","v":0},null,{"$f":"IFERROR(LOOKUP($D97,SSV_Organisation[Vereinsname],SSV_Organisation[Grp.Dpp.]),0)","v":0},{"$f":"IF(AND(P97<7,M97>0),1,IF(AND(P97<13,M97>1),2,IF(AND(P97<19,M97>2),3,IF(AND(P97<25,M97>3),4,IF(AND(P97<31,M97>4),5,IF(AND(P97<37,M97>5),6,0))))))","v":0},null,"","","","","",{"$f":"IF(T97<>\"\",(LOOKUP(T97,Alterskategorie!$A$2:$A$110,Alterskategorie!$B$2:$B$110)),\"\")","v":""}]
["",null,null,null,null,{"$f":"IF(B98<>\"\",(LOOKUP(T98,Alterskategorie!$A$2:$A$110,Alterskategorie!$B$2:$B$110)),\"\")","v":""},null,null,null,{"$f":"IF(IF(P98=1,K98,IF(AND(K98<>0,D98=D97),J97+K98,0))>J$4,K98,IF(P98=1,K98,IF(AND(K98<>0,D98=D97),J97+K98,0)))","v":0},{"$f":"IF($P98<=M98*6,$G98,0)","v":0},null,{"$f":"IFERROR(LOOKUP($D98,SSV_Organisation[Vereinsname],SSV_Organisation[Grp.Dpp.]),0)","v":0},{"$f":"IF(AND(P98<7,M98>0),1,IF(AND(P98<13,M98>1),2,IF(AND(P98<19,M98>2),3,IF(AND(P98<25,M98>3),4,IF(AND(P98<31,M98>4),5,IF(AND(P98<37,M98>5),6,0))))))","v":0},null,"","","","","",{"$f":"IF(T98<>\"\",(LOOKUP(T98,Alterskategorie!$A$2:$A$110,Alterskategorie!$B$2:$B$110)),\"\")","v":""}]
["",null,null,null,null,{"$f":"IF(B99<>\"\",(LOOKUP(T99,Alterskategorie!$A$2:$A$110,Alterskategorie!$B$2:$B$110)),\"\")","v":""},null,null,null,{"$f":"IF(IF(P99=1,K99,IF(AND(K99<>0,D99=D98),J98+K99,0))>J$4,K99,IF(P99=1,K99,IF(AND(K99<>0,D99=D98),J98+K99,0)))","v":0},{"$f":"IF($P99<=M99*6,$G99,0)","v":0},null,{"$f":"IFERROR(LOOKUP($D99,SSV_Organisation[Vereinsname],SSV_Organisation[Grp.Dpp.]),0)","v":0},{"$f":"IF(AND(P99<7,M99>0),1,IF(AND(P99<13,M99>1),2,IF(AND(P99<19,M99>2),3,IF(AND(P99<25,M99>3),4,IF(AND(P99<31,M99>4),5,IF(AND(P99<37,M99>5),6,0))))))","v":0},null,"","","","","",{"$f":"IF(T99<>\"\",(LOOKUP(T99,Alterskategorie!$A$2:$A$110,Alterskategorie!$B$2:$B$110)),\"\")","v":""}]
["",null,null,null,null,{"$f":"IF(B100<>\"\",(LOOKUP(T100,Alterskategorie!$A$2:$A$110,Alterskategorie!$B$2:$B$110)),\"\")","v":""},null,null,null,{"$f":"IF(IF(P100=1,K100,IF(AND(K100<>0,D100=D99),J99+K100,0))>J$4,K100,IF(P100=1,K100,IF(AND(K100<>0,D100=D99),J99+K100,0)))","v":0},{"$f":"IF($P100<=M100*6,$G100,0)","v":0},null,{"$f":"IFERROR(LOOKUP($D100,SSV_Organisation[Vereinsname],SSV_Organisation[Grp.Dpp.]),0)","v":0},{"$f":"IF(AND(P100<7,M100>0),1,IF(AND(P100<13,M100>1),2,IF(AND(P100<19,M100>2),3,IF(AND(P100<25,M100>3),4,IF(AND(P100<31,M100>4),5,IF(AND(P100<37,M100>5),6,0))))))","v":0},null,"","","","","",{"$f":"IF(T100<>\"\",(LOOKUP(T100,Alterskategorie!$A$2:$A$110,Alterskategorie!$B$2:$B$110)),\"\")","v":""}]
["",null,null,null,null,{"$f":"IF(B101<>\"\",(LOOKUP(T101,Alterskategorie!$A$2:$A$110,Alterskategorie!$B$2:$B$110)),\"\")","v":""},null,null,null,{"$f":"IF(IF(P101=1,K101,IF(AND(K101<>0,D101=D100),J100+K101,0))>J$4,K101,IF(P101=1,K101,IF(AND(K101<>0,D101=D100),J100+K101,0)))","v":0},{"$f":"IF($P101<=M101*6,$G101,0)","v":0},null,{"$f":"IFERROR(LOOKUP($D101,SSV_Organisation[Vereinsname],SSV_Organisation[Grp.Dpp.]),0)","v":0},{"$f":"IF(AND(P101<7,M101>0),1,IF(AND(P101<13,M101>1),2,IF(AND(P101<19,M101>2),3,IF(AND(P101<25,M101>3),4,IF(AND(P101<31,M101>4),5,IF(AND(P101<37,M101>5),6,0))))))","v":0},null,"","","","","",{"$f":"IF(T101<>\"\",(LOOKUP(T101,Alterskategorie!$A$2:$A$110,Alterskategorie!$B$2:$B$110)),\"\")","v":""}]
["",null,null,null,null,{"$f":"IF(B102<>\"\",(LOOKUP(T102,Alterskategorie!$A$2:$A$110,Alterskategorie!$B$2:$B$110)),\"\")","v":""},null,null,null,{"$f":"IF(IF(P102=1,K102,IF(AND(K102<>0,D102=D101),J101+K102,0))>J$4,K102,IF(P102=1,K102,IF(AND(K102<>0,D102=D101),J101+K102,0)))","v":0},{"$f":"IF($P102<=M102*6,$G102,0)","v":0},null,{"$f":"IFERROR(LOOKUP($D102,SSV_Organisation[Vereinsname],SSV_Organisation[Grp.Dpp.]),0)","v":0},{"$f":"IF(AND(P102<7,M102>0),1,IF(AND(P102<13,M102>1),2,IF(AND(P102<19,M102>2),3,IF(AND(P102<25,M102>3),4,IF(AND(P102<31,M102>4),5,IF(AND(P102<37,M102>5),6,0))))))","v":0},null,"","","","","",{"$f":"IF(T102<>\"\",(LOOKUP(T102,Alterskategorie!$A$2:$A$110,Alterskategorie!$B$2:$B$110)),\"\")","v":""}]
["",null,null,null,null,{"$f":"IF(B103<>\"\",(LOOKUP(T103,Alterskategorie!$A$2:$A$110,Alterskategorie!$B$2:$B$110)),\"\")","v":""},null,null,null,{"$f":"IF(IF(P103=1,K103,IF(AND(K103<>0,D103=D102),J102+K103,0))>J$4,K103,IF(P103=1,K103,IF(AND(K103<>0,D103=D102),J102+K103,0)))","v":0},{"$f":"IF($P103<=M103*6,$G103,0)","v":0},null,{"$f":"IFERROR(LOOKUP($D103,SSV_Organisation[Vereinsname],SSV_Organisation[Grp.Dpp.]),0)","v":0},{"$f":"IF(AND(P103<7,M103>0),1,IF(AND(P103<13,M103>1),2,IF(AND(P103<19,M103>2),3,IF(AND(P103<25,M103>3),4,IF(AND(P103<31,M103>4),5,IF(AND(P103<37,M103>5),6,0))))))","v":0},null,"","","","","",{"$f":"IF(T103<>\"\",(LOOKUP(T103,Alterskategorie!$A$2:$A$110,Alterskategorie!$B$2:$B$110)),\"\")","v":""}]
["",null,null,null,null,{"$f":"IF(B104<>\"\",(LOOKUP(T104,Alterskategorie!$A$2:$A$110,Alterskategorie!$B$2:$B$110)),\"\")","v":""},null,null,null,{"$f":"IF(IF(P104=1,K104,IF(AND(K104<>0,D104=D103),J103+K104,0))>J$4,K104,IF(P104=1,K104,IF(AND(K104<>0,D104=D103),J103+K104,0)))","v":0},{"$f":"IF($P104<=M104*6,$G104,0)","v":0},null,{"$f":"IFERROR(LOOKUP($D104,SSV_Organisation[Vereinsname],SSV_Organisation[Grp.Dpp.]),0)","v":0},{"$f":"IF(AND(P104<7,M104>0),1,IF(AND(P104<13,M104>1),2,IF(AND(P104<19,M104>2),3,IF(AND(P104<25,M104>3),4,IF(AND(P104<31,M104>4),5,IF(AND(P104<37,M104>5),6,0))))))","v":0},null,"","","","","",{"$f":"IF(T104<>\"\",(LOOKUP(T104,Alterskategorie!$A$2:$A$110,Alterskategorie!$B$2:$B$110)),\"\")","v":""}]
["",null,null,null,null,{"$f":"IF(B105<>\"\",(LOOKUP(T105,Alterskategorie!$A$2:$A$110,Alterskategorie!$B$2:$B$110)),\"\")","v":""},null,null,null,{"$f":"IF(IF(P105=1,K105,IF(AND(K105<>0,D105=D104),J104+K105,0))>J$4,K105,IF(P105=1,K105,IF(AND(K105<>0,D105=D104),J104+K105,0)))","v":0},{"$f":"IF($P105<=M105*6,$G105,0)","v":0},null,{"$f":"IFERROR(LOOKUP($D105,SSV_Organisation[Vereinsname],SSV_Organisation[Grp.Dpp.]),0)","v":0},{"$f":"IF(AND(P105<7,M105>0),1,IF(AND(P105<13,M105>1),2,IF(AND(P105<19,M105>2),3,IF(AND(P105<25,M105>3),4,IF(AND(P105<31,M105>4),5,IF(AND(P105<37,M105>5),6,0))))))","v":0},null,"","","","","",{"$f":"IF(T105<>\"\",(LOOKUP(T105,Alterskategorie!$A$2:$A$110,Alterskategorie!$B$2:$B$110)),\"\")","v":""}]
["",null,null,null,null,{"$f":"IF(B106<>\"\",(LOOKUP(T106,Alterskategorie!$A$2:$A$110,Alterskategorie!$B$2:$B$110)),\"\")","v":""},null,null,null,{"$f":"IF(IF(P106=1,K106,IF(AND(K106<>0,D106=D105),J105+K106,0))>J$4,K106,IF(P106=1,K106,IF(AND(K106<>0,D106=D105),J105+K106,0)))","v":0},{"$f":"IF($P106<=M106*6,$G106,0)","v":0},null,{"$f":"IFERROR(LOOKUP($D106,SSV_Organisation[Vereinsname],SSV_Organisation[Grp.Dpp.]),0)","v":0},{"$f":"IF(AND(P106<7,M106>0),1,IF(AND(P106<13,M106>1),2,IF(AND(P106<19,M106>2),3,IF(AND(P106<25,M106>3),4,IF(AND(P106<31,M106>4),5,IF(AND(P106<37,M106>5),6,0))))))","v":0},null,"","","","","",{"$f":"IF(T106<>\"\",(LOOKUP(T106,Alterskategorie!$A$2:$A$110,Alterskategorie!$B$2:$B$110)),\"\")","v":""}]
["",null,null,null,null,{"$f":"IF(B107<>\"\",(LOOKUP(T107,Alterskategorie!$A$2:$A$110,Alterskategorie!$B$2:$B$110)),\"\")","v":""},null,null,null,{"$f":"IF(IF(P107=1,K107,IF(AND(K107<>0,D107=D106),J106+K107,0))>J$4,K107,IF(P107=1,K107,IF(AND(K107<>0,D107=D106),J106+K107,0)))","v":0},{"$f":"IF($P107<=M107*6,$G107,0)","v":0},null,{"$f":"IFERROR(LOOKUP($D107,SSV_Organisation[Vereinsname],SSV_Organisation[Grp.Dpp.]),0)","v":0},{"$f":"IF(AND(P107<7,M107>0),1,IF(AND(P107<13,M107>1),2,IF(AND(P107<19,M107>2),3,IF(AND(P107<25,M107>3),4,IF(AND(P107<31,M107>4),5,IF(AND(P107<37,M107>5),6,0))))))","v":0},null,"","","","","",{"$f":"IF(T107<>\"\",(LOOKUP(T107,Alterskategorie!$A$2:$A$110,Alterskategorie!$B$2:$B$110)),\"\")","v":""}]
["",null,null,null,null,{"$f":"IF(B108<>\"\",(LOOKUP(T108,Alterskategorie!$A$2:$A$110,Alterskategorie!$B$2:$B$110)),\"\")","v":""},null,null,null,{"$f":"IF(IF(P108=1,K108,IF(AND(K108<>0,D108=D107),J107+K108,0))>J$4,K108,IF(P108=1,K108,IF(AND(K108<>0,D108=D107),J107+K108,0)))","v":0},{"$f":"IF($P108<=M108*6,$G108,0)","v":0},null,{"$f":"IFERROR(LOOKUP($D108,SSV_Organisation[Vereinsname],SSV_Organisation[Grp.Dpp.]),0)","v":0},{"$f":"IF(AND(P108<7,M108>0),1,IF(AND(P108<13,M108>1),2,IF(AND(P108<19,M108>2),3,IF(AND(P108<25,M108>3),4,IF(AND(P108<31,M108>4),5,IF(AND(P108<37,M108>5),6,0))))))","v":0},null,"","","","","",{"$f":"IF(T108<>\"\",(LOOKUP(T108,Alterskategorie!$A$2:$A$110,Alterskategorie!$B$2:$B$110)),\"\")","v":""}]
[null,null,"*= ohne Lizenz "]
[null,null,null,"Gruppen mit weniger als 4 Schützen sind nicht rangiert!"]
[null,null,null,"Gruppen"]
[]
[null,null,{"$f":"IF(G113=\"\",\"\",1)","v":""}]
[null,null,{"$f":"IF(D114>\"\",C113+1,\"\")","v":""}]
[null,null,""]
[null,null,""]
[null,null,""]
[null,null,""]
[null,null,""]
[null,null,""]
[null,null,""]
[null,null,""]
[null,null,""]
[null,null,""]
[null,null,""]
[null,null,""]
[null,null,""]
[null,null,""]
[null,null,""]
[null,null,""]
[null,null,""]
[null,null,""]
[null,null,""]
[null,null,""]

{"sheet":"DataSource","index":10,"n_rows":629,"n_cols":59,"rows_kept":629,"cut":false,"hidden":true,"merged":[]}
["PersonNumber","AddressNumber","FirstName","LastName","Company","Addition","Street","PostCode","City","Country","BusinessLandlinePhone","BusinessMobilePhone","PrivateLandlinePhone","PrivateMobilePhone","PrimaryEmail","Webpage","Gender","BirthDate","InsuranceNumber","Language","Nationality","OrganizationNumber","OrganizationName","IsActive","IsPassive","IsOtherAddressee","IsInsured","MembershipCategory","Remark","LicenseCategory","LicenseType","Salutation","AdditionalEmail","Deceased","OptedInForAdvertising","EntryDate","OfficialFunctionCategory","OfficialFunctionEntryDate","OfficialFunctionRemark","UseOnBoardAndFunctionaryReport","LicenseInvoicingClubNumber","LicenseInvoicingClubName","CourseCategory","Module","CompletedTrainingDate","TrainingStatus","NewsletterSSVType","SwissShootingSubscriptionType","SwissShootingSubscriptionStart","SwissShootingSubscriptionEnd","IsSingleSwissShootingSubscription","IsNewsletterMailDelivery","MuseumDataSalutation","MuseumDataCategory","ExitDate","OfficialFunctionExitDate","CompletedTrainingExpirationDate","SwissShootingSubscriptionAmount","Exported On"]
["1060763","112678","Werner","Hänggi","","Postfach 205","Städelistr. 7","9220","Bischofszell","CH","","","","","","","Männlich","10.08.1947","","Deutsch","CH","1.44.0.00.007","Bischofszell Sportschützen",1,0,0,1,"Aktiv-A G50m","","A","LizenzG50m","Herr","",0,1,"01.01.2023","","","",0,"1.20.0.01.026","Bischofszell Stadtschützen","","","","Aktiv","Newsletter Email","Abonnement","27.07.2023","","Nein","Nein","","","","","",1,"01.12.2023 14:27"]
["1060753","112668","Bernhard","Bischof","","","Bruggmühle 11","9220","Bischofszell","CH","071 424 26 56","","071 422 35 22","","bischof.beni@bluewin.ch","","Männlich","19.04.1949","","Deutsch","CH","1.44.0.00.007","Bischofszell Sportschützen",1,0,0,1,"Aktiv-A G50m","","A","LizenzG50m","Herr","",0,1,"01.01.2023","","","",0,"1.44.0.00.007","Bischofszell Sportschützen","","","","Aktiv","Newsletter Email","Abonnement","27.07.2023","","Nein","Nein","","","","","",1,"01.12.2023 14:27"]
["1060780","112695","Urs","Zihlmann","","","Rümlangerstr. 14","8105","Watt","CH","","","044 840 09 62","079 771 08 45","urzi@hispeed.ch","","Männlich","17.01.1955","","Deutsch","CH","1.44.0.00.007","Bischofszell Sportschützen",1,0,0,1,"Aktiv-B G50m","","B","LizenzG50m","Herr","",0,1,"01.01.2013","","","",0,"1.20.0.01.040","Hefenhofen-Dozwil Schützengesellschaft","","","","Aktiv","Newsletter Email","Abonnement","27.07.2023","","Nein","Nein","","","","","",1,"01.12.2023 14:27"]
["1060753","112668","Bernhard","Bischof","","","Bruggmühle 11","9220","Bischofszell","CH","071 424 26 56","","071 422 35 22","","bischof.beni@bluewin.ch","","Männlich","19.04.1949","","Deutsch","CH","1.44.0.00.007","Bischofszell Sportschützen",1,0,0,1,"Aktiv-A G10m Auflage","","A","LizenzG10m","Herr","",0,1,"01.10.2018","","","",0,"1.44.0.00.007","Bischofszell Sportschützen","","","","Aktiv","Newsletter Email","Abonnement","27.07.2023","","Nein","Nein","","","","","",1,"01.12.2023 14:27"]
["1060868","112783","Marlen","Schilliger","","","Städeliweg 5","9220","Bischofszell","CH","","","071 422 43 13","071 993 29 07","mschilliger@bluewin.ch","","Weiblich","02.10.1983","","Deutsch","CH","1.44.0.00.007","Bischofszell Sportschützen",1,0,0,1,"Aktiv-B G50m","","B","LizenzG50m","Frau","",0,0,"01.01.2023","","","",0,"1.44.0.00.055","Dicken Ebnat-Kappel Sportschützen","","","","Aktiv","Newsletter Email","Abonnement","27.07.2023","","Nein","Nein","","","","","",1,"01.12.2023 14:27"]
["1262339","314267","Thomas","Mäder","","","Ifangweg 4","8508","Homburg","CH","052 269 18 20","","052 765 27 75","079 326 34 75","thomas_maeder@bluewin.ch","","Männlich","22.04.1975","","Deutsch","CH","1.44.0.00.007","Bischofszell Sportschützen",1,0,0,1,"Aktiv-A G10m Auflage","","A","LizenzG10m","Herr","finanzen@ospsv.ch",0,1,"01.10.2021","","","",0,"1.44.0.00.010","Dettighofen Sportschützen","","","","Aktiv","Newsletter Email","Abonnement","27.07.2023","","Nein","Nein","","","","","",1,"01.12.2023 14:27"]
["1032180","008863","Rita","Burch","","","Obere Rebrainstr. 19","9213","Hauptwil","CH","","","071 422 40 67","079 698 09 31","rita.burch@resta.ch","","Weiblich","02.03.1952","","Deutsch","CH","1.44.0.00.007","Bischofszell Sportschützen",1,0,0,1,"Aktiv-A G50m","","A","LizenzG50m","Frau","",0,1,"22.02.2022","","","",0,"1.44.0.00.007","Bischofszell Sportschützen","","","","Aktiv","","","","","","","","","","","","","01.12.2023 14:27"]
["1056243","108158","Roman","Frei","","","Romanshornerstr. 28","8592","Uttwil","CH","","","0714636287","0795066168","freiroman@bluewin.ch","","Männlich","28.09.1961","756.6932.3539.64","Deutsch","CH","1.44.0.00.007","Bischofszell Sportschützen",1,0,0,1,"Aktiv-A G10m","","A","LizenzG10m","Herr","",0,1,"01.01.2023","","","",0,"1.44.0.00.007","Bischofszell Sportschützen","","","","Aktiv","Newsletter Email","Abonnement","27.07.2023","","Nein","Nein","","","","","",1,"01.12.2023 14:27"]
["1056243","108158","Roman","Frei","","","Romanshornerstr. 28","8592","Uttwil","CH","","","0714636287","0795066168","freiroman@bluewin.ch","","Männlich","28.09.1961","756.6932.3539.64","Deutsch","CH","1.44.0.00.007","Bischofszell Sportschützen",1,0,0,1,"Aktiv-B G50m","","B","LizenzG50m","Herr","",0,1,"01.01.2015","","","",0,"1.44.0.00.007","Bischofszell Sportschützen","","","","Aktiv","Newsletter Email","Abonnement","27.07.2023","","Nein","Nein","","","","","",1,"01.12.2023 14:27"]
["1060784","112699","Evelyn","Forster","","","Bergstr. 17c","8280","Kreuzlingen","CH","","","","","garage.h.u.forster@bluewin.ch","","Weiblich","22.11.1953","","Deutsch","CH","1.44.0.00.008","Bottighofen Sportschützen",1,0,0,1,"Aktiv-A G50m","","A","LizenzG50m","Frau","",0,1,"01.01.2023","","","",0,"1.44.0.00.008","Bottighofen Sportschützen","","","","Aktiv","Newsletter Email","Abonnement","27.07.2023","","Nein","Nein","","","","","",1,"01.12.2023 14:27"]
["1060782","112697","Kurt","Brack","","","Bromstr. 10","8598","Bottighofen","CH","","","","","kurt.brack@bluewin.ch","","Männlich","06.12.1971","","Deutsch","CH","1.44.0.00.008","Bottighofen Sportschützen",1,0,0,1,"Aktiv-A G50m","","A","LizenzG50m","Herr","",0,1,"01.01.2023","","","",0,"1.44.0.00.008","Bottighofen Sportschützen","","","","Aktiv","","","","","","","","","","","","","01.12.2023 14:27"]
["1277069","328999","Maurizio","Roviaro","","","Kappelerweg 24","8570","Weinfelden","CH","","","","","maurizio.roviaro@bluewin.ch","","Männlich","03.09.1959","","Deutsch","CH","1.44.0.00.008","Bottighofen Sportschützen",1,0,0,1,"Aktiv-A G50m","","A","LizenzG50m","Herr","",0,1,"01.01.2023","","","",0,"1.44.0.00.008","Bottighofen Sportschützen","","","","Aktiv","Newsletter Email","Abonnement","27.07.2023","","Nein","Nein","","","","","",1,"01.12.2023 14:27"]
["1060785","112700","Hans-Ulrich","Forster","","","Bergstr. 17c","8280","Kreuzlingen","CH","071 672 6055","","079 291 1993","","hans-ulrich.forster@bluewin.ch","","Männlich","24.10.1951","756.7753.5938.74","Deutsch","CH","1.44.0.00.008","Bottighofen Sportschützen",1,0,0,1,"Aktiv-A G50m","","A","LizenzG50m","Herr","",0,1,"01.01.2023","","","",0,"1.44.0.00.008","Bottighofen Sportschützen","","","","Aktiv","Newsletter Email","Abonnement","27.07.2023","","Nein","Nein","","","","","",1,"01.12.2023 14:27"]
["1060783","112698","Markus","Brunschwiler","","","Pfaffenwiesstr. 6","8598","Bottighofen","CH","","","071 688 1140","","markus.brunschwiler@gmx.ch","","Männlich","13.05.1956","756.6695.0756.84","Deutsch","CH","1.44.0.00.008","Bottighofen Sportschützen",1,0,0,1,"Aktiv-A G50m","","A","LizenzG50m","Herr","",0,1,"01.01.2023","","","",0,"1.44.0.00.008","Bottighofen Sportschützen","","","","Aktiv","Newsletter Email","Abonnement","27.07.2023","","Nein","Nein","","","","","",1,"01.12.2023 14:27"]
["1060781","112696","Oscar","Bär","","","Wasenstr. 21","8280","Kreuzlingen","CH","","","","","oscar.baer@osba.ch","","Männlich","15.12.1960","","Deutsch","CH","1.44.0.00.008","Bottighofen Sportschützen",1,0,0,1,"Aktiv-A G50m","","A","LizenzG50m","Herr","",0,1,"01.01.2023","","","",0,"1.44.0.00.008","Bottighofen Sportschützen","","","","Aktiv","Newsletter Email","Abonnement","27.07.2023","","Nein","Nein","","","","","",1,"01.12.2023 14:27"]
["1277062","328992","Marco","Roviaro","","","Schäflerstr. 2","8280","Kreuzlingen","CH","","","","079 962 28 91","marco.roviaro@bluewin.ch","","Männlich","16.04.1987","","Deutsch","CH","1.44.0.00.008","Bottighofen Sportschützen",1,0,0,1,"Aktiv-A G50m","","A","LizenzG50m","Herr","",0,1,"01.01.2023","","","",0,"1.44.0.00.008","Bottighofen Sportschützen","","","","Aktiv","Newsletter Email","Abonnement","27.07.2023","","Nein","Nein","","","","","",1,"01.12.2023 14:27"]
["1060847","112762","Roland","Schär","","","Kirchbergstr.16","8512","Thundorf","CH","","","052 376 33 20","079 563 03 52","iro.schaer@bluewin.ch","","Männlich","16.03.1946","","Deutsch","CH","1.44.0.00.010","Dettighofen Sportschützen",1,0,0,1,"Aktiv-A G50m","","A","LizenzG50m","Herr","",0,0,"01.01.2023","","","",0,"1.20.0.04.104","Thunbachtal Schützen","","","","Aktiv","Newsletter Email","","","","","Nein","","","","","","","01.12.2023 14:27"]
["1679422","746282","Julia","Meier","","","In der Breite 2","8532","Warth","CH","","","052 765 20 67","079 289 57 49","meier.julia@bluewin.ch","","Weiblich","27.11.1976","","Deutsch","CH","1.44.0.00.010","Dettighofen Sportschützen",1,0,0,1,"Aktiv-A G50m","","A","LizenzG50m","Frau","",0,0,"02.03.2023","","","",0,"1.20.0.04.104","Thunbachtal Schützen","","","","Aktiv","Newsletter Email","Abonnement","27.07.2023","15.10.2023","Nein","Nein","","","","","",1,"01.12.2023 14:27"]
["1857020","935555","Jenny","Mosch","","","Hub 17","9463","Oberriet SG","CH","","","071 761 31 70","","andy.mosch@bluewin.ch","","Weiblich","07.03.2006","756.1382.8683.96","Deutsch","CH","1.44.0.00.001","Altstätten Sportschützen",1,0,0,1,"Aktiv-A G50m","","A","LizenzG50m","Frau","",0,0,"28.04.2021","","","",0,"1.44.0.00.001","Altstätten Sportschützen","","","","Aktiv","Newsletter Email","","","","","Nein","","","","","","","01.12.2023 14:27"]
["1061071","112986","Toni","Mattle","","","Klausstr. 15","9450","Altstätten SG","CH","","","071 755 40 80","079 281 74 25","toni.mattle@gmx.ch","","Männlich","19.05.1959","","Deutsch","CH","1.44.0.00.001","Altstätten Sportschützen",1,0,0,1,"Aktiv-A G50m","","A","LizenzG50m","Herr","",0,0,"20.06.2017","","","",0,"1.44.0.00.001","Altstätten Sportschützen","","","","Aktiv","Newsletter Email","","","","","Nein","","","","","","","01.12.2023 14:27"]
["1071270","123186","Andreas","Widmer","","","Birkenstr. 9","9463","Oberriet","CH","","","071 535 75 84","079 330 75 76","resu@yetnet.ch","","Männlich","22.09.1983","","Deutsch","CH","1.44.0.00.001","Altstätten Sportschützen",1,0,0,1,"Aktiv-A G10m","","A","LizenzG10m","Herr","",0,0,"01.09.2011","","","",0,"1.44.0.00.001","Altstätten Sportschützen","","","","Aktiv","Newsletter Email","Abonnement","27.07.2023","","Nein","Nein","","","","","",1,"01.12.2023 14:27"]
["1658476","723827","Chantal","Meier","","","Ehrenhaustr. 9","8105","Watt","CH","","","","079 / 480 88 86","chantal@bleiki.ch","","Weiblich","01.09.2000","","Deutsch","CH","1.44.0.00.001","Altstätten Sportschützen",1,0,0,1,"Aktiv-B G10m","","B","LizenzG10m","Frau","",0,1,"25.10.2019","","","",0,"1.01.0.11.173","Zürich-Neumünster Standschützengesellschaft","","","","Aktiv","Newsletter Email","Abonnement","27.07.2023","","Nein","Nein","","","","","",1,"01.12.2023 14:27"]
["1846955","925179","Noé","Fares","","","Am Wasser 100 G","8049","Zürich","CH","","","043 541 90 19","076 435 17 04","noefares10@gmail.com","","Männlich","17.01.2004","756.9790.2398.38","Deutsch","CH","1.44.0.00.001","Altstätten Sportschützen",1,0,0,1,"Aktiv-B G10m","","B","LizenzG10m","Herr","",0,1,"25.11.2023","","","",0,"1.01.0.11.173","Zürich-Neumünster Standschützengesellschaft","","","","Aktiv","Newsletter Email","Abonnement","27.07.2023","","Nein","Nein","","","","","",1,"01.12.2023 14:27"]
["1259477","311405","Michael","Götti","","","","9463","Oberriet","CH","","","079 846 40 37","079 846 40 37","michael.goetti@rettung-sg.ch","","Männlich","21.05.1992","756.9803.1164.15","Deutsch","CH","1.44.0.00.001","Altstätten Sportschützen",1,0,0,1,"Aktiv-A G10m","","A","LizenzG10m","Herr","jsl@fsg-marbach.ch",0,0,"30.11.2020","","","",0,"1.44.0.00.001","Altstätten Sportschützen","","","","Aktiv","Newsletter Email","Abonnement","27.07.2023","","Nein","Nein","","","","","",1,"01.12.2023 14:27"]
["1061074","112989","Walter","Nüesch","","","Nelkenstr. 205","9435","Heerbrugg","CH","","","071 722 19 43","","nuwa@bluewin.ch","","Männlich","31.07.1941","","Deutsch","CH","1.44.0.00.001","Altstätten Sportschützen",1,0,0,1,"Aktiv-A G50m","","A","LizenzG50m","Herr","",0,0,"07.04.2017","","","",0,"1.17.0.04.009","Rebstein, SV Balgach-Rebstein","","","","Aktiv","Newsletter Email","Abonnement","27.07.2023","","Nein","Nein","","","","","",1,"01.12.2023 14:27"]
["1798300","873912","Sven","Sprenger","","","Kriessernstr. 6B","9462","Montlingen","CH","","","071 761 00 67","","p-sprenger@bluewin.ch","","Männlich","21.05.2008","756.5579.7282.27","Deutsch","CH","1.44.0.00.001","Altstätten Sportschützen",1,0,0,1,"Aktiv-A G10m","","A","LizenzG10m","Herr","",0,0,"01.10.2023","","","",0,"1.17.0.04.005","Altstätten-Stadt Schützenverein","","","","Aktiv","","","","","","","","","31.12.2023","","","","01.12.2023 14:27"]
["1243859","295786","Barbara","Schläpfer","","","Oberzwislen 2a","9056","Gais","CH","","","","","barbara_93@gmx.ch","","Weiblich","06.01.1993","","Deutsch","CH","1.44.0.00.001","Altstätten Sportschützen",1,0,0,1,"Aktiv-B G10m","","B","LizenzG10m","Frau","",0,0,"24.02.2020","","","",0,"1.15.0.00.002","Gais Sportschützen","","","","Aktiv","","Abonnement","27.07.2023","","Nein","","","","","","",1,"01.12.2023 14:27"]
["1060736","112651","Josef","Wildhaber","","","Spitzackerstr. 7","7310","Bad Ragaz","CH","","","081 302 52 52","","josef.wildhaber@bluewin.ch","","Männlich","22.09.1959","","Deutsch","CH","1.44.0.00.004","Bad Ragaz Kleinkaliberschützen",1,0,0,1,"Aktiv-A G50m","","A","LizenzG50m","Herr","",0,1,"01.01.2023","","","",0,"1.44.0.00.004","Bad Ragaz Kleinkaliberschützen","","","","Aktiv","Newsletter Email","Abonnement","27.07.2023","","Nein","Nein","","","","","",1,"01.12.2023 14:27"]
["1060731","112646","Reto","Lüthi","","","Vorstadtgasse 31","7304","Maienfeld","CH","","","","079 256 22 12","retoluethi@gmx.ch","","Männlich","03.10.1980","756.6187.1571.26","Deutsch","CH","1.44.0.00.004","Bad Ragaz Kleinkaliberschützen",1,0,0,1,"Aktiv-A G50m","","A","LizenzG50m","Herr","",0,0,"17.03.1999","","","",0,"1.18.0.01.085","St.Luzisteig Vereinigte Schützengesellschaft","","","","Aktiv","Newsletter Email","Abonnement","27.07.2023","","Nein","Nein","","","","","",1,"01.12.2023 14:27"]
["1236249","288176","Benjamin","Gort","","","Aeulistr. 12","7310","Bad Ragaz","CH","","","","","b-gort@hotmail.com","","Männlich","01.08.1989","756.2541.1901.05","Deutsch","CH","1.44.0.00.004","Bad Ragaz Kleinkaliberschützen",1,0,0,1,"Aktiv-A G50m","","A","LizenzG50m","Herr","",0,0,"01.01.2023","","","",0,"1.44.0.00.004","Bad Ragaz Kleinkaliberschützen","","","","Aktiv","Newsletter Email","Abonnement","27.07.2023","","Nein","Nein","","","","","",1,"01.12.2023 14:27"]
["1060727","112642","Anton","Brunold","","","Ochsenbrunnen 3","7310","Bad Ragaz","CH","","","081 302 45 58","","brunold-toni@bluewin.ch","","Männlich","16.05.1957","","Deutsch","CH","1.44.0.00.004","Bad Ragaz Kleinkaliberschützen",1,0,0,1,"Aktiv-A G50m","","A","LizenzG50m","Herr","",0,1,"01.01.2023","","","",0,"1.44.0.00.004","Bad Ragaz Kleinkaliberschützen","","","","Aktiv","Newsletter Email","Abonnement","27.07.2023","","Nein","Nein","","","","","",1,"01.12.2023 14:27"]
["1044623","021388","Svetlana","Sidorenko","","","Kronenplatz 8","7310","Bad Ragaz","CH","","","","","svetlana.sidorenko@yahoo.com","","Weiblich","14.09.1988","","Deutsch","MD","1.44.0.00.004","Bad Ragaz Kleinkaliberschützen",1,0,0,1,"Aktiv-A G50m","","A","LizenzG50m","Frau","",0,0,"24.03.2023","","","",0,"1.44.0.00.004","Bad Ragaz Kleinkaliberschützen","","","","Aktiv","Newsletter Email","Abonnement","27.07.2023","","Nein","Nein","","","","","",1,"01.12.2023 14:27"]
["1060733","112648","Markus","Probst","Guscha Consult GmbH","","Weiligstr. 30a","7310","Bad Ragaz","CH","081 330 72 51","","081 330 72 53","","markus@guschakopf.ch","","Männlich","17.11.1958","","Deutsch","CH","1.44.0.00.004","Bad Ragaz Kleinkaliberschützen",1,0,0,1,"Aktiv-A G50m","","A","LizenzG50m","Herr","m.probst@guscha-consult.ch",0,0,"01.01.2023","","","",0,"1.44.0.00.004","Bad Ragaz Kleinkaliberschützen","","","","Aktiv","Newsletter Email","Abonnement","27.07.2023","","Nein","Nein","","","","","",1,"01.12.2023 14:27"]
["1248288","300215","Dominik","Gort","","","Taminastr. 30a","7310","Bad Ragaz","CH","","","","","d_gort@hotmail.com","","Männlich","17.02.1988","756.9737.2115.69","Deutsch","CH","1.44.0.00.004","Bad Ragaz Kleinkaliberschützen",1,0,0,1,"Aktiv-A G50m","","A","LizenzG50m","Herr","",0,0,"01.01.2017","","","",0,"1.44.0.00.004","Bad Ragaz Kleinkaliberschützen","","","","Aktiv","Newsletter Email","Abonnement","27.07.2023","","Nein","Nein","","","","","",1,"01.12.2023 14:27"]
["1903471","984207","Reinhold","Flad","","","Chlenglerweg 98c","8240","Thayngen","CH","","","","","","","Männlich","07.01.1969","","Deutsch","CH","1.44.0.00.013","Schaffhausen Sportschützen Munot",1,0,0,1,"Aktiv-A G50m","","A","LizenzG50m","Herr","",0,1,"23.03.2018","","","",0,"1.44.0.00.013","Schaffhausen Sportschützen Munot","","","","Aktiv","Newsletter Email","","","","","Nein","","","","","","","01.12.2023 14:27"]
["1028781","005426","Karim","Gad","","","Kamorstr. 15","8200","Schaffhausen","CH","","","","","","","Männlich","02.04.2003","","Deutsch","CH","1.44.0.00.013","Schaffhausen Sportschützen Munot",1,0,0,1,"Aktiv-A G50m","","A","LizenzG50m","Herr","",0,1,"01.06.2021","","","",0,"1.44.0.00.013","Schaffhausen Sportschützen Munot","","","","Aktiv","Newsletter Email","Abonnement","27.07.2023","","Nein","Nein","","","","","",1,"01.12.2023 14:27"]
["1032537","009221","Roland","Hagen","","","Zehntenstr. 1","8536","Hüttwilen","CH","","","","079 322 64 40","rohagen65@gmail.com","","Männlich","09.04.1965","756.2108.5550.64","Deutsch","CH","1.44.0.00.010","Dettighofen Sportschützen",1,0,0,1,"Aktiv-A G50m","","A","LizenzG50m","Herr","",0,1,"31.03.2022","","","",0,"1.44.0.00.010","Dettighofen Sportschützen","","","","Aktiv","Kein Newsletter","","","","","Nein","","","","","","","01.12.2023 14:27"]
["1060812","112727","Roman","Barth","","","Südrainstr. 10","8508","Homburg","CH","","","052 763 27 58","","roman.barth@bluewin.ch","","Männlich","02.02.1971","756.7354.6389.67","Deutsch","CH","1.44.0.00.010","Dettighofen Sportschützen",1,0,0,1,"Aktiv-A G50m","","A","LizenzG50m","Herr","",0,0,"01.01.2023","","","",0,"1.44.0.00.010","Dettighofen Sportschützen","","","","Aktiv","","","","","","","","","","","","","01.12.2023 14:27"]
["1025897","002504","Joel","Kutter","","","Breitwies 7","8532","Weiningen TG","CH","","","052 552 15 61","","","","Männlich","03.01.2010","756.4029.3686.62","Deutsch","CH","1.44.0.00.010","Dettighofen Sportschützen",1,0,0,1,"Aktiv-A G50m","","A","LizenzG50m","Herr","",0,0,"01.03.2021","","","",0,"1.44.0.00.010","Dettighofen Sportschützen","","","","Aktiv","","","","","","","","","","","","","01.12.2023 14:27"]
["1114176","166094","Marco","Meier","","","In der Breite 2","8532","Warth TG","CH","","","052 765 20 67","076 562 20 67","praesident@schuetzen-thunbachtal.ch","","Männlich","21.04.1973","756.3865.8474.30","Deutsch","CH","1.44.0.00.010","Dettighofen Sportschützen",1,0,0,1,"Aktiv-A G50m","","A","LizenzG50m","Herr","",0,0,"01.01.2006","","","",0,"1.20.0.04.104","Thunbachtal Schützen","","","","Aktiv","Newsletter Email","Abonnement","27.07.2023","","Nein","Nein","","","","","",1,"01.12.2023 14:27"]
["1346380","398312","Ruedi","Salzmann","","","Steckbornerstr. 14","8535","Herdern","CH","","","052 747 11 64","079 605 67 32","ruedi.salzmann@gmx.ch","","Männlich","01.03.1961","756.8116.8353.03","Deutsch","CH","1.44.0.00.010","Dettighofen Sportschützen",1,0,0,1,"Aktiv-A G50m","","A","LizenzG50m","Herr","",0,0,"07.03.2019","","","",0,"1.20.0.03.101","Herdern-Lanzenneunforn Schützengesellschaft","","","","Aktiv","Newsletter Email","Abonnement","27.07.2023","","Nein","Nein","","","","","",1,"01.12.2023 14:27"]
["1226225","278152","Claudia","Gantenbein","","","Baumgartenstr. 30","8505","Dettighofen","CH","","","","079 317 37 70","loewenfelben@stafag.ch","","Weiblich","10.01.1976","","Deutsch","CH","1.44.0.00.010","Dettighofen Sportschützen",1,0,0,1,"Aktiv-A G50m","","A","LizenzG50m","Frau","",0,0,"03.03.2004","","","",0,"1.44.0.00.010","Dettighofen Sportschützen","","","","Aktiv","Newsletter Email","","","","","Nein","","","","","","","01.12.2023 14:27"]
["1253171","305099","Sibylle","Bassetto","","","Unterdorfstr. 1b","8507","Hörhausen","CH","","","","079 812 72 75","sibylle@bassetto.net","","Weiblich","07.09.1989","","Deutsch","CH","1.44.0.00.010","Dettighofen Sportschützen",1,0,0,1,"Aktiv-A G50m","","A","LizenzG50m","Frau","",0,0,"03.03.2010","","","",0,"1.44.0.00.010","Dettighofen Sportschützen","","","","Aktiv","","","","","","","","","","","","","01.12.2023 14:27"]
["1116911","168830","Samuel","Mürner","","","Fabrikstr. 54","8005","Zürich","CH","","","","079 603 80 28","samuerner@bluewin.ch","","Männlich","19.09.1977","","Deutsch","CH","1.44.0.00.010","Dettighofen Sportschützen",1,0,0,1,"Aktiv-A G50m","","A","LizenzG50m","Herr","",0,0,"01.01.2006","","","",0,"1.20.0.03.083","Hüttwilen-Nussbaumen Schützenverein","","","","Aktiv","Newsletter Email","","","","","Nein","","","","","","","01.12.2023 14:27"]
["1262339","314267","Thomas","Mäder","","","Ifangweg 4","8508","Homburg","CH","052 269 18 20","","052 765 27 75","079 326 34 75","thomas_maeder@bluewin.ch","","Männlich","22.04.1975","","Deutsch","CH","1.44.0.00.010","Dettighofen Sportschützen",1,0,0,1,"Aktiv-A G50m","","A","LizenzG50m","Herr","finanzen@ospsv.ch",0,1,"02.03.2011","","","",0,"1.44.0.00.010","Dettighofen Sportschützen","","","","Aktiv","Newsletter Email","Abonnement","27.07.2023","","Nein","Nein","","","","","",1,"01.12.2023 14:27"]
["1060760","112675","Roman","Frei","","","Hintere Büelstr. 17a","9246","Niederbüren","CH","","","","","g6_roman@bluewin.ch","","Männlich","30.01.1979","","Deutsch","CH","1.44.0.00.007","Bischofszell Sportschützen",1,0,0,1,"Aktiv-A G50m","","A","LizenzG50m","Herr","",0,1,"01.01.2023","","","",0,"1.44.0.00.007","Bischofszell Sportschützen","","","","Aktiv","Newsletter Email","Abonnement","27.07.2023","","Nein","Nein","","","","","",1,"01.12.2023 14:27"]
["1060774","112689","Marcel","Schilliger","","","Städeliweg 5","9220","Bischofszell","CH","","","071 422 43 13","078 646 77 82","mschilliger@bluewin.ch","","Männlich","26.06.1981","756.9933.3369.43","Deutsch","CH","1.44.0.00.007","Bischofszell Sportschützen",1,0,0,1,"Aktiv-B G50m","","B","LizenzG50m","Herr","praesident@ospsv.ch",0,1,"01.01.2023","","","",0,"1.44.0.00.007","Bischofszell Sportschützen","","","","Aktiv","Newsletter Email","Abonnement","27.07.2023","","Nein","Nein","","","","","",1,"01.12.2023 14:27"]
["1226295","278222","Patrick","Zihlmann","","","Obere Hagenwilerstr. 5","8588","Zihlschlacht","CH","","","","+41 76 310 99 96","zihlmpat@bluewin.ch","","Männlich","09.04.1987","","Deutsch","CH","1.44.0.00.007","Bischofszell Sportschützen",1,0,0,1,"Aktiv-A G10m","","A","LizenzG10m","Herr","",0,0,"01.01.2023","","","",0,"1.44.0.00.007","Bischofszell Sportschützen","","","","Aktiv","Newsletter Email","Abonnement","27.07.2023","","Nein","Nein","","","","","",1,"01.12.2023 14:27"]
["1226295","278222","Patrick","Zihlmann","","","Obere Hagenwilerstr. 5","8588","Zihlschlacht","CH","","","","+41 76 310 99 96","zihlmpat@bluewin.ch","","Männlich","09.04.1987","","Deutsch","CH","1.44.0.00.007","Bischofszell Sportschützen",1,0,0,1,"Aktiv-B G50m","","B","LizenzG50m","Herr","",0,0,"01.01.2023","","","",0,"1.44.0.00.007","Bischofszell Sportschützen","","","","Aktiv","Newsletter Email","Abonnement","27.07.2023","","Nein","Nein","","","","","",1,"01.12.2023 14:27"]
["1686729","754279","Jan","Mäder","","","Ifangweg 4","8508","Homburg","CH","","","052 765 27 75","077 401 83 91","maeder.jan@bluewin.ch","","Männlich","21.09.2002","756.4262.5262.56","Deutsch","CH","1.44.0.00.007","Bischofszell Sportschützen",1,0,0,1,"Aktiv-A G10m","","A","LizenzG10m","Herr","",0,1,"01.10.2018","","","",0,"1.44.0.00.010","Dettighofen Sportschützen","","","","Aktiv","Newsletter Email","","","","","Nein","","","","","","","01.12.2023 14:27"]
["1060767","112682","Daniel","Kägi","","Postfach 203","Espenstr. 24","9220","Bischofszell","CH","","","071 422 29 41","","","","Männlich","26.12.1974","","Deutsch","CH","1.44.0.00.007","Bischofszell Sportschützen",1,0,0,1,"Aktiv-A G50m","","A","LizenzG50m","Herr","",0,1,"01.01.2023","","","",0,"1.44.0.00.007","Bischofszell Sportschützen","","","","Aktiv","Newsletter Email","Abonnement","27.07.2023","","Nein","Nein","","","","","",1,"01.12.2023 14:27"]
["1060752","112667","Albert","Baumann","","","Fürstenlandstr. 59","9500","Wil SG","CH","","","071 911 54 84","","baumann.albert@bluewin.ch","","Männlich","03.09.1959","756.7457.3682.97","Deutsch","CH","1.44.0.00.007","Bischofszell Sportschützen",0,0,0,1,"Aktiv-A G10m","","A","LizenzG10m","Herr","",1,0,"01.01.2023","","","",0,"1.44.0.00.007","Bischofszell Sportschützen","","","","Aktiv","Newsletter Email","Abonnement","27.07.2023","","Nein","Nein","","","04.09.2023","","",1,"01.12.2023 14:27"]
["1060752","112667","Albert","Baumann","","","Fürstenlandstr. 59","9500","Wil SG","CH","","","071 911 54 84","","baumann.albert@bluewin.ch","","Männlich","03.09.1959","756.7457.3682.97","Deutsch","CH","1.44.0.00.007","Bischofszell Sportschützen",0,0,0,1,"Aktiv-A G50m","","A","LizenzG50m","Herr","",1,0,"01.01.2023","","","",0,"1.44.0.00.007","Bischofszell Sportschützen","","","","Aktiv","Newsletter Email","Abonnement","27.07.2023","","Nein","Nein","","","04.09.2023","","",1,"01.12.2023 14:27"]
["1060768","112683","Daniel","Leibundgut","","","Bürglistr. 12","9000","St. Gallen","CH","","","071 246 30 24","","","","Männlich","28.03.1971","","Deutsch","CH","1.44.0.00.007","Bischofszell Sportschützen",1,0,0,1,"Aktiv-A G50m","","A","LizenzG50m","Herr","",0,1,"01.01.2023","","","",0,"1.44.0.00.007","Bischofszell Sportschützen","","","","Aktiv","Newsletter Email","Abonnement","27.07.2023","","Nein","Nein","","","","","",1,"01.12.2023 14:27"]
["1798296","873908","Arno","Segmüller","","","Harztannenstr. 3","9450","Altstätten SG","CH","","","071 755 69 06","","w.segi@bluewin.ch","","Männlich","06.07.2006","","Deutsch","CH","1.44.0.00.001","Altstätten Sportschützen",1,0,0,1,"Aktiv-A G50m","","A","LizenzG50m","Herr","",0,0,"23.05.2023","","","",0,"1.44.0.00.001","Altstätten Sportschützen","","","","Aktiv","","Abonnement","23.05.2023","","Nein","","","","","","",1,"01.12.2023 14:27"]
["1060669","112584","Patrick","Sprenger","","","Kriessernstr. 6B","9462","Montlingen","CH","","","071 761 00 67","079 331 37 93","p-sprenger@bluewin.ch","","Männlich","22.10.1976","756.8468.4373.85","Deutsch","CH","1.44.0.00.001","Altstätten Sportschützen",1,0,0,1,"Aktiv-A G10m","","A","LizenzG10m","Herr","",0,0,"01.01.2023","","","",0,"1.44.0.00.001","Altstätten Sportschützen","","","","Aktiv","Newsletter Email","Abonnement","27.07.2023","31.12.2023","Nein","Nein","","","31.12.2023","","",1,"01.12.2023 14:27"]
["1061062","112977","Ronny","Graf","","","Torkelstr. 11","9445","Rebstein","CH","","","071 777 27 14","078 611 80 13","ronny.graf@bluewin.ch","","Männlich","27.06.1974","","Deutsch","CH","1.44.0.00.001","Altstätten Sportschützen",1,0,0,1,"Aktiv-A G10m","","A","LizenzG10m","Herr","",0,0,"01.01.2023","","","",0,"1.44.0.00.001","Altstätten Sportschützen","","","","Aktiv","Newsletter Email","Abonnement","27.07.2023","","Nein","Nein","","","","","",1,"01.12.2023 14:27"]
["1060672","112587","Rudolf","Wetli","","","Hintere Kobelstr. 1a","9442","Berneck","CH","071 767 79 50","","071 744 61 54","","rudolf.wetli@gmail.com","","Männlich","14.02.1951","","Deutsch","CH","1.44.0.00.001","Altstätten Sportschützen",1,0,0,1,"Aktiv-A G10m","","A","LizenzG10m","Herr","",0,0,"11.11.2015","","","",0,"1.17.0.04.005","Altstätten-Stadt Schützenverein","","","","Aktiv","Newsletter Email","Abonnement","27.07.2023","","Nein","Nein","","","","","",1,"01.12.2023 14:27"]
["1060672","112587","Rudolf","Wetli","","","Hintere Kobelstr. 1a","9442","Berneck","CH","071 767 79 50","","071 744 61 54","","rudolf.wetli@gmail.com","","Männlich","14.02.1951","","Deutsch","CH","1.44.0.00.001","Altstätten Sportschützen",1,0,0,1,"Aktiv-A G50m","","A","LizenzG50m","Herr","",0,0,"01.01.2023","","","",0,"1.17.0.04.005","Altstätten-Stadt Schützenverein","","","","Aktiv","Newsletter Email","Abonnement","27.07.2023","","Nein","Nein","","","","","",1,"01.12.2023 14:27"]
["1786240","860907","Gian","Sprenger","","","Kriessnerstr. 6b","9462","Montlingen","CH","","","071 761 00 67","","p-sprenger@bluewin.ch","","Männlich","18.10.2006","","Deutsch","CH","1.44.0.00.001","Altstätten Sportschützen",1,0,0,1,"Aktiv-A G10m","","A","LizenzG10m","Herr","",0,0,"20.12.2018","","","",0,"1.17.0.04.005","Altstätten-Stadt Schützenverein","","","","Aktiv","","","","","","","","","31.12.2023","","","","01.12.2023 14:27"]
["1061056","112971","Christof","Eugster","","","Langackerweg 2","9450","Altstätten SG","CH","","","071 755 42 47","079 366 55 61","christofeugster@bluewin.ch","","Männlich","22.08.1980","","Deutsch","CH","1.44.0.00.001","Altstätten Sportschützen",1,0,0,1,"Aktiv-A G50m","","A","LizenzG50m","Herr","",0,0,"07.04.2017","","","",0,"1.44.0.00.001","Altstätten Sportschützen","","","","Aktiv","Newsletter Email","Abonnement","27.07.2023","","Nein","Nein","","","","","",1,"01.12.2023 14:27"]
["1630998","694676","Jason","Santer","","","Zürcherstr. 13","8956","Killwangen","CH","","","","078 / 614 85 70","jason.santer@outlook.de","","Männlich","12.07.1997","756.3284.1310.11","Deutsch","CH","1.44.0.00.001","Altstätten Sportschützen",1,0,0,1,"Aktiv-B G10m","","B","LizenzG10m","Herr","",0,1,"06.01.2020","","","",0,"1.01.0.11.173","Zürich-Neumünster Standschützengesellschaft","","","","Aktiv","","","","","","","","","","","","","01.12.2023 14:27"]
["1798294","873906","Nando","Segmüller","","","Harztannenstr. 3","9450","Altstätten","CH","","","071 755 69 06","","segi.nando03@gmail.com","","Männlich","07.12.2003","","Deutsch","CH","1.44.0.00.001","Altstätten Sportschützen",1,0,0,1,"Aktiv-A G10m","","A","LizenzG10m","Herr","",0,0,"02.11.2020","","","",0,"1.44.0.00.001","Altstätten Sportschützen","","","","Aktiv","","","","","","","","","","","","","01.12.2023 14:27"]
["1207663","259589","Fabian","Meili","","","Herbigstr. 11","8267","Berlingen","CH","","","","079 451 38 39","fabian.flow@bluewin.ch","","Männlich","21.04.1991","756.4577.6892.88","Deutsch","CH","1.44.0.00.010","Dettighofen Sportschützen",1,0,0,1,"Aktiv-A G50m","","A","LizenzG50m","Herr","",0,0,"01.01.2003","","","",0,"1.44.0.00.010","Dettighofen Sportschützen","","","","Aktiv","Newsletter Email","","","","","Nein","","","","","","","01.12.2023 14:27"]
["1060837","112752","Hansjörg","Lang","","","Oberhofstr. 9","8265","Mammern","CH","","","052 741 49 57","079 431 83 27","h.lang@bluewin.ch","","Männlich","06.06.1948","756.8697.8126.49","Deutsch","CH","1.44.0.00.010","Dettighofen Sportschützen",1,0,0,1,"Aktiv-A G50m","","A","LizenzG50m","Herr","",0,0,"01.01.2023","","","",0,"1.20.0.03.108","Mammern Feldschützen","","","","Aktiv","Newsletter Email","Abonnement","27.07.2023","","Nein","Nein","","","","","",1,"01.12.2023 14:27"]
["1061481","113396","Urs","Fuster","","","unteres Ziel 3","9050","Appenzell","CH","","","071 787 11 65","","mac.ufuster@bluewin.ch","","Männlich","10.08.1953","756.4892.8189.98","Deutsch","CH","1.44.0.00.010","Dettighofen Sportschützen",1,0,0,1,"Aktiv-B G50m","","B","LizenzG50m","Herr","",0,1,"02.03.2011","","","",0,"1.16.0.00.001","Appenzell, Schützenverein","","","","Aktiv","Newsletter Email","","","","","Nein","","","","","","","01.12.2023 14:27"]
["1043700","020462","Jda","Fröhlich","","","Lindenstr. 9","8558","Raperswilen","CH","","","052 763 26 23","079 267 92 71","","","Weiblich","18.03.1952","","Deutsch","CH","1.44.0.00.010","Dettighofen Sportschützen",1,0,0,1,"Aktiv-A G50m","","A","LizenzG50m","Frau","",0,1,"01.01.2023","","","",0,"1.44.0.00.010","Dettighofen Sportschützen","","","","Aktiv","Newsletter Email","Abonnement","27.07.2023","","Nein","Nein","","","","","",1,"01.12.2023 14:27"]
["1822781","899787","Bettina","Patt","","","Hauptstr. 13","8512","Thundorf","CH","","","","","bettina_patt@bluewin.ch","","Weiblich","23.06.1978","","Deutsch","CH","1.44.0.00.010","Dettighofen Sportschützen",1,0,0,1,"Aktiv-A G50m","","A","LizenzG50m","Frau","",0,1,"01.03.2018","","","",0,"1.20.0.04.104","Thunbachtal Schützen","","","","Aktiv","Newsletter Email","","","","","Nein","","","","","","","01.12.2023 14:27"]
["1792424","867617","Stefan","Wettstein","","","Hohlgasse 4","8532","Weiningen","CH","","","052 747 23 11","079 236 18 10","stefan.wettstein@bluewin.ch","","Männlich","19.02.1968","","Deutsch","CH","1.44.0.00.010","Dettighofen Sportschützen",1,0,0,1,"Aktiv-A G50m","","A","LizenzG50m","Herr","",0,1,"02.03.2017","","","",0,"1.44.0.00.010","Dettighofen Sportschützen","","","","Aktiv","Newsletter Email","Abonnement","27.07.2023","","Nein","Nein","","","","","",1,"01.12.2023 14:27"]
["1096144","148061","Bernhard","Meili","","","Steckbornerstr. 30","8535","Herdern","CH","","","","079 278 92 84","mei-kor@hotmail.com","","Männlich","20.07.1950","","Deutsch","CH","1.44.0.00.010","Dettighofen Sportschützen",1,0,0,1,"Aktiv-A G50m","","A","LizenzG50m","Herr","",0,0,"03.03.2004","","","",0,"1.20.0.03.101","Herdern-Lanzenneunforn Schützengesellschaft","","","","Aktiv","Newsletter Email","Abonnement","27.07.2023","","Nein","Nein","","","","","",1,"01.12.2023 14:27"]
["1239805","291732","Nadja","Kübler","","","Oberi Breiti 6","8500","Gerlikon","CH","","","052 720 98 30","076 459 12 66","nadjakuebler137@gmail.com","","Weiblich","03.10.1995","756.2274.5064.95","Deutsch","CH","1.44.0.00.010","Dettighofen Sportschützen",1,0,0,1,"Aktiv-A G50m","","A","LizenzG50m","Frau","",0,0,"01.03.2013","","","",0,"1.20.0.04.089","Gachnang Tegelbachschützen","","","","Aktiv","Newsletter Email","","","","","Nein","","","","","","","01.12.2023 14:27"]
["1060823","112738","Stephan","Fröhlich","","","Sonnenhaldenstr. 6","8508","Homburg","CH","","","052 720 28 09","079 503 73 92","ste.froehlich@bluewin.ch","","Männlich","19.09.1978","756.8065.0362.02","Deutsch","CH","1.44.0.00.010","Dettighofen Sportschützen",1,0,0,1,"Aktiv-A G50m","","A","LizenzG50m","Herr","",0,0,"01.01.2023","","","",0,"1.20.0.03.144","Salenstein Standschützengesellschaft","","","","Aktiv","Newsletter Email","Abonnement","27.07.2023","","Nein","Nein","","","","","",1,"01.12.2023 14:27"]
["1798294","873906","Nando","Segmüller","","","Harztannenstr. 3","9450","Altstätten","CH","","","071 755 69 06","","segi.nando03@gmail.com","","Männlich","07.12.2003","","Deutsch","CH","1.44.0.00.001","Altstätten Sportschützen",1,0,0,1,"Aktiv-A G50m","","A","LizenzG50m","Herr","",0,0,"12.04.2021","","","",0,"1.44.0.00.001","Altstätten Sportschützen","","","","Aktiv","","","","","","","","","","","","","01.12.2023 14:27"]
["1492091","544371","Lukas","Grassi","","","Finkenweg 9","9463","Oberriet","CH","","","","079 630 07 46","grassi.luki@gmail.com","","Männlich","15.06.1992","756.0323.9938.76","Deutsch","CH","1.44.0.00.001","Altstätten Sportschützen",0,0,0,1,"Aktiv-A G50m","","A","LizenzG50m","Herr","",0,1,"27.04.2022","","","",0,"1.17.0.04.044","Hub-Hard Schützenverein","","","","Aktiv","Newsletter Email","Abonnement","27.07.2023","","Nein","Nein","","","25.11.2023","","",1,"01.12.2023 14:27"]
["1492091","544371","Lukas","Grassi","","","Finkenweg 9","9463","Oberriet","CH","","","","079 630 07 46","grassi.luki@gmail.com","","Männlich","15.06.1992","756.0323.9938.76","Deutsch","CH","1.44.0.00.001","Altstätten Sportschützen",1,0,0,1,"Aktiv-A G10m","","A","LizenzG10m","Herr","",0,1,"24.11.2023","","","",0,"1.17.0.04.044","Hub-Hard Schützenverein","","","","Aktiv","Newsletter Email","Abonnement","27.07.2023","","Nein","Nein","","","","","",1,"01.12.2023 14:27"]
["1071270","123186","Andreas","Widmer","","","Birkenstr. 9","9463","Oberriet","CH","","","071 535 75 84","079 330 75 76","resu@yetnet.ch","","Männlich","22.09.1983","","Deutsch","CH","1.44.0.00.001","Altstätten Sportschützen",1,0,0,1,"Aktiv-A G50m","","A","LizenzG50m","Herr","",0,0,"07.04.2017","","","",0,"1.44.0.00.001","Altstätten Sportschützen","","","","Aktiv","Newsletter Email","Abonnement","27.07.2023","","Nein","Nein","","","","","",1,"01.12.2023 14:27"]
["1060669","112584","Patrick","Sprenger","","","Kriessernstr. 6B","9462","Montlingen","CH","","","071 761 00 67","079 331 37 93","p-sprenger@bluewin.ch","","Männlich","22.10.1976","756.8468.4373.85","Deutsch","CH","1.44.0.00.001","Altstätten Sportschützen",1,0,0,1,"Aktiv-A G50m","","A","LizenzG50m","Herr","",0,0,"01.01.2023","","","",0,"1.44.0.00.001","Altstätten Sportschützen","","","","Aktiv","Newsletter Email","Abonnement","27.07.2023","31.12.2023","Nein","Nein","","","31.12.2023","","",1,"01.12.2023 14:27"]
["1613427","675530","Oliver","Hunziker","","","Industriestr. 47","8152","Glattbrugg","CH","","","","","oli.hunziker@bluewin.ch","","Männlich","20.10.1998","756.7682.6774.61","Deutsch","CH","1.44.0.00.001","Altstätten Sportschützen",1,0,0,1,"Aktiv-B G10m","","B","LizenzG10m","Herr","",0,1,"09.01.2020","","","",0,"1.01.0.11.173","Zürich-Neumünster Standschützengesellschaft","","","","Aktiv","Newsletter Email","Abonnement","27.07.2023","","Nein","Nein","","","","","",1,"01.12.2023 14:27"]
["1079572","131488","Valentin","Koch","","","Moosweg 2","9445","Rebstein","CH","071 770 06 60","","071 770 06 62","079 417 51 15","koch.vali@sunrise.ch","","Männlich","25.06.1953","","Deutsch","CH","1.44.0.00.001","Altstätten Sportschützen",1,0,0,1,"Aktiv-A G50m","","A","LizenzG50m","Herr","",0,0,"19.02.2002","","","",0,"1.17.0.04.005","Altstätten-Stadt Schützenverein","","","","Aktiv","","Abonnement","27.07.2023","","Nein","","","","","","",1,"01.12.2023 14:27"]
["1798296","873908","Arno","Segmüller","","","Harztannenstr. 3","9450","Altstätten SG","CH","","","071 755 69 06","","w.segi@bluewin.ch","","Männlich","06.07.2006","","Deutsch","CH","1.44.0.00.001","Altstätten Sportschützen",1,0,0,1,"Aktiv-A G10m","","A","LizenzG10m","Herr","",0,0,"02.11.2020","","","",0,"1.44.0.00.001","Altstätten Sportschützen","","","","Aktiv","","Abonnement","23.05.2023","","Nein","","","","","","",1,"01.12.2023 14:27"]
["1061058","112973","Ramona","Eugster","","","Birkenstr. 9","9463","Oberriet SG","CH","","","071 535 75 84","","ra.eugster@bluewin.ch","","Weiblich","19.07.1983","756.4766.6644.92","Deutsch","CH","1.44.0.00.001","Altstätten Sportschützen",1,0,0,1,"Aktiv-A G10m","","A","LizenzG10m","Frau","",0,0,"01.01.2023","","","",0,"1.44.0.00.001","Altstätten Sportschützen","","","","Aktiv","Newsletter Email","","","","","Nein","","","","","","","01.12.2023 14:27"]
["1036906","013619","Sascha","Jäger","","","Taastrasse 3","9113","Degersheim","CH","","","","077 462 22 09","s.jaeger.ch@gmail.com","","Männlich","19.07.2003","756.4556.0386.56","Deutsch","CH","1.44.0.00.009","Degersheim Sportschützen",1,0,0,1,"Aktiv-A G50m","","A","LizenzG50m","Herr","",0,1,"29.03.2022","","","",0,"1.44.0.00.009","Degersheim Sportschützen","","","","Aktiv","Newsletter Email","Abonnement","27.07.2023","","Nein","Nein","","","","","",1,"01.12.2023 14:27"]
["1061359","113274","Bruno","Müller","","","Im Grund 16a","9012","St. Gallen","CH","","","","079 437 17 21","bruno.noeg@bluewin.ch","","Männlich","08.07.1953","","Deutsch","CH","1.44.0.00.009","Degersheim Sportschützen",1,0,0,1,"Aktiv-B G50m","","B","LizenzG50m","Herr","",0,1,"20.03.2018","","","",0,"1.17.0.01.091","St. Gallen Feldschützengesellschaft der Stadt","","","","Aktiv","Newsletter Email","Abonnement","27.07.2023","","Nein","Nein","","","","","",1,"01.12.2023 14:27"]
["1048359","100273","Hans","Dütschler","","","Gleisweg 3","9104","Waldstatt","CH","","","071 352 14 57","079 702 83 63","hans.dtschler@bluewin.ch","","Männlich","23.10.1954","756.2137.6856.95","Deutsch","CH","1.44.0.00.009","Degersheim Sportschützen",1,0,0,1,"Aktiv-A G50m","","A","LizenzG50m","Herr","matchchef300m@ksv-ar.ch",0,0,"01.01.2004","","","",0,"1.15.0.00.037","Waldstatt Schützengesellschaft","","","","Aktiv","Newsletter Email","Abonnement","27.07.2023","","Nein","Nein","","","","","",1,"01.12.2023 14:27"]
["1870727","950075","Alexander","Jäger","","","Taastr. 3","9113","Degersheim","CH","","","","077 474 30 43","ajaeger.ch@gmail.com","","Männlich","14.05.1973","","Deutsch","CH","1.44.0.00.009","Degersheim Sportschützen",1,0,0,1,"Aktiv-A G50m","","A","LizenzG50m","Herr","",0,0,"20.03.2019","","","",0,"1.44.0.00.009","Degersheim Sportschützen","","","","Aktiv","Newsletter Email","Abonnement","27.07.2023","","Nein","Nein","","","","","",1,"01.12.2023 14:27"]
["1060760","112675","Roman","Frei","","","Hintere Büelstr. 17a","9246","Niederbüren","CH","","","","","g6_roman@bluewin.ch","","Männlich","30.01.1979","","Deutsch","CH","1.44.0.00.007","Bischofszell Sportschützen",1,0,0,1,"Aktiv-A G10m","","A","LizenzG10m","Herr","",0,1,"01.01.2023","","","",0,"1.44.0.00.007","Bischofszell Sportschützen","","","","Aktiv","Newsletter Email","Abonnement","27.07.2023","","Nein","Nein","","","","","",1,"01.12.2023 14:27"]
["1721301","791385","Sara","Bartholdi","","","Obidörfli 16","9220","Bischofszell","CH","","","","","sara.bartholdi@bluewin.ch","","Weiblich","22.03.2001","","Deutsch","CH","1.44.0.00.007","Bischofszell Sportschützen",1,0,0,1,"Aktiv-B G10m","","B","LizenzG10m","Frau","",0,0,"26.10.2019","","","",0,"1.44.0.00.037","Sitterdorf Sportschützen","","","","Aktiv","Newsletter Email","","","","","Nein","","","","","","","01.12.2023 14:27"]
["1060755","112670","Blasius","Burch","","","Ob. Rebrainstr. 19","9213","Hauptwil","CH","071 394 10 90","","071 422 40 67","","resta.ag@bluewin.ch","","Männlich","19.01.1948","","Deutsch","CH","1.44.0.00.007","Bischofszell Sportschützen",1,0,0,1,"Aktiv-A G50m","","A","LizenzG50m","Herr","blasius.burch@resta.ch",0,0,"01.01.2023","","","",0,"1.20.0.01.026","Bischofszell Stadtschützen","","","","Aktiv","Newsletter Email","Abonnement","27.07.2023","","Nein","Nein","","","","","",1,"01.12.2023 14:27"]
["1060758","112673","Hans","Frei","","","Hauptstr. 9","8580","Sommeri","CH","","","071 411 42 22","","ha.frei@bluewin.ch","","Männlich","04.02.1946","","Deutsch","CH","1.44.0.00.007","Bischofszell Sportschützen",1,0,0,1,"Aktiv-A G10m Auflage","","A","LizenzG10m","Herr","",0,1,"01.10.2018","","","",0,"1.44.0.00.007","Bischofszell Sportschützen","","","","Aktiv","Kein Newsletter","Abonnement","27.07.2023","","Nein","Nein","","","","","",1,"01.12.2023 14:27"]
["1060758","112673","Hans","Frei","","","Hauptstr. 9","8580","Sommeri","CH","","","071 411 42 22","","ha.frei@bluewin.ch","","Männlich","04.02.1946","","Deutsch","CH","1.44.0.00.007","Bischofszell Sportschützen",1,0,0,1,"Aktiv-A G50m","","A","LizenzG50m","Herr","",0,1,"01.01.2023","","","",0,"1.44.0.00.007","Bischofszell Sportschützen","","","","Aktiv","Kein Newsletter","Abonnement","27.07.2023","","Nein","Nein","","","","","",1,"01.12.2023 14:27"]
["1032539","009223","Marcel","Salathé","","","Zehntenstr. 8a","8536","Hüttwilen","CH","","","052 747 14 32","079 479 30 09","marcel.salathe@stafag.ch","","Männlich","30.06.1963","756.2708.7417.68","Deutsch","CH","1.44.0.00.010","Dettighofen Sportschützen",1,0,0,1,"Aktiv-A G50m","","A","LizenzG50m","Herr","",0,1,"31.03.2022","","","",0,"1.44.0.00.010","Dettighofen Sportschützen","","","","Aktiv","Newsletter Email","","","","","Nein","","","","","","","01.12.2023 14:27"]
["1039169","015910","Linn","Hagen","","","Unteres Steimürli 3","8536","Hüttwilen","CH","","","","","","","Weiblich","11.08.2009","756.0801.2511.84","Deutsch","CH","1.44.0.00.010","Dettighofen Sportschützen",1,0,0,1,"Aktiv-A G50m","","A","LizenzG50m","Frau","",0,0,"02.03.2023","","","",0,"1.44.0.00.010","Dettighofen Sportschützen","","","","Aktiv","","","","","","","","","","","","","01.12.2023 14:27"]
["1078065","129981","Mischa","Peter","","","Hauptstr. 13","8512","Thundorf","CH","","","","078 671 36 42","mpe76@bluewin.ch","","Männlich","01.03.1976","","Deutsch","CH","1.44.0.00.010","Dettighofen Sportschützen",1,0,0,1,"Aktiv-A G50m","","A","LizenzG50m","Herr","",0,1,"01.01.2023","","","",0,"1.20.0.04.104","Thunbachtal Schützen","","","","Aktiv","Newsletter Email","","","","","Nein","","","","","","","01.12.2023 14:27"]
["1060811","112726","Hardy","Barth","","","Südrainstr. 10","8508","Homburg","CH","","","","077 404 26 82","eberhard.barth@bluewin.ch","","Männlich","09.07.1934","","Deutsch","CH","1.44.0.00.010","Dettighofen Sportschützen",1,0,0,1,"Aktiv-B G50m","","B","LizenzG50m","Herr","",0,1,"02.03.2023","","","",0,"1.01.0.12.034","Rickenbach Sportschützen","","","","Aktiv","","","","","","","","","","","","","01.12.2023 14:27"]
["1260431","312359","Pascal","Perren","","","Zehntenstr. 7","8536","Hüttwilen","CH","","","","078 791 15 65","perren_@hotmail.com","","Männlich","30.04.1988","756.3120.1500.77","Deutsch","CH","1.44.0.00.010","Dettighofen Sportschützen",1,0,0,1,"Aktiv-B G50m","","B","LizenzG50m","Herr","",0,0,"01.06.2023","","","",0,"1.44.0.00.006","Bazenheid Sportschützen","","","","Aktiv","Newsletter Email","Abonnement","27.07.2023","","Nein","Nein","","","","","",1,"01.12.2023 14:27"]
["1123335","175254","Hansueli","Ott","","","Unterer Brüel 36","8505","Pfyn","CH","","","052 765 28 00","076 565 79 88","hansueli.ott@stafag.ch","www.sg-pfyn.ch","Männlich","09.10.1958","","Deutsch","CH","1.44.0.00.010","Dettighofen Sportschützen",1,0,0,1,"Aktiv-A G50m","","A","LizenzG50m","Herr","",0,1,"01.01.2023","","","",0,"1.20.0.03.130","Pfyn Schützengesellschaft","","","","Aktiv","Newsletter Email","","","","","Nein","","","","","","","01.12.2023 14:27"]
["1128120","180040","Martin","Rutz","","","Frauenfelderstr. 37","8514","Amlikon-Bissegg","CH","","","071 650 05 70","079 601 40 19","martin.rutz@rutzgmbh.ch","","Männlich","17.02.1970","756.8609.4029.37","Deutsch","CH","1.44.0.00.046","Wängi Sportschützen",1,0,0,1,"Aktiv-A G50m","","A","LizenzG50m","Herr","",0,0,"27.01.2016","","","",0,"1.44.0.00.046","Wängi Sportschützen","","","","Aktiv","","","","","","","","","","","","","01.12.2023 14:27"]
["1061430","113345","Albert","Schwager","","","Tiefenstein 11","8354","Hofstetten ZH","CH","","","052 364 24 33","079 629 86 97","albert.schwager@bluewin.ch","www.sgelgg.ch","Männlich","15.04.1955","","Deutsch","CH","1.44.0.00.046","Wängi Sportschützen",1,0,0,1,"Aktiv-A G50m","","A","LizenzG50m","Herr","",0,0,"01.01.2023","","","",0,"1.44.0.00.046","Wängi Sportschützen","","","","Aktiv","","","","","","","","","","","","","01.12.2023 14:27"]
["1686729","754279","Jan","Mäder","","","Ifangweg 4","8508","Homburg","CH","","","052 765 27 75","077 401 83 91","maeder.jan@bluewin.ch","","Männlich","21.09.2002","756.4262.5262.56","Deutsch","CH","1.44.0.00.010","Dettighofen Sportschützen",1,0,0,1,"Aktiv-A G50m","","A","LizenzG50m","Herr","",0,1,"17.06.2014","","","",0,"1.44.0.00.010","Dettighofen Sportschützen","","","","Aktiv","Newsletter Email","","","","","Nein","","","","","","","01.12.2023 14:27"]
["1060671","112586","Andrés","Viveros","","","Kapellweg 88","9443","Widnau","CH","071 388 55 29","","071 733 28 67","079 391 60 67","andres.viveros@rsnweb.ch","","Männlich","06.02.1967","","Deutsch","CH","1.44.0.00.001","Altstätten Sportschützen",1,0,0,1,"Aktiv-A G50m","","A","LizenzG50m","Herr","andres.viveros@ffb-group.ch",0,0,"01.01.2023","","","",0,"1.44.0.00.001","Altstätten Sportschützen","","","","Aktiv","Newsletter Email","Abonnement","27.07.2023","","Nein","Nein","","","","","",1,"01.12.2023 14:27"]
["1024904","001504","Joe","Segmüller","","","Harztannenstr. 3","9450","Altstätten SG","CH","","","071 755 69 06","","w.segi@bluewin.ch","","Männlich","16.02.2010","","Deutsch","CH","1.44.0.00.001","Altstätten Sportschützen",1,0,0,1,"Aktiv-A G50m","","A","LizenzG50m","Herr","",0,0,"23.05.2023","","","",0,"1.44.0.00.001","Altstätten Sportschützen","","","","Aktiv","","","","","","","","","","","","","01.12.2023 14:27"]
["1405335","457271","Sladjana","Marjanovic","","","Elsenackerstr. 6","9450","Altstätten","CH","","","071 / 755 83 05","078 / 769 95 27","s.marjanovic@windowslive.com","","Weiblich","03.05.1974","","Deutsch","RS","1.44.0.00.001","Altstätten Sportschützen",1,0,0,1,"Aktiv-A G10m","","A","LizenzG10m","Frau","",0,0,"17.04.2009","","","",0,"1.44.0.00.001","Altstätten Sportschützen","","","","Aktiv","Newsletter Email","Abonnement","27.07.2023","","Nein","Nein","","","","","",1,"01.12.2023 14:27"]
["1061057","112972","Manuela","Eugster","","","Luegete 34","8053","Zürich","CH","","","","079 376 92 74","eugstermanuela@hotmail.com","","Weiblich","17.04.1979","756.1228.1224.77","Deutsch","CH","1.44.0.00.001","Altstätten Sportschützen",1,0,0,1,"Aktiv-A G10m","","A","LizenzG10m","Frau","",0,0,"30.03.2007","","","",0,"1.01.0.11.173","Zürich-Neumünster Standschützengesellschaft","","","","Aktiv","Newsletter Email","Abonnement","27.07.2023","","Nein","Nein","","","","","",1,"01.12.2023 14:27"]
["1846953","925177","Malo","Jaboulet","","","Im oberen Boden 21","8049","Zürich","CH","","","","079 178 62 42","malo@cojabou.com","","Männlich","02.04.2004","756.1850.8613.17","Deutsch","CH","1.44.0.00.001","Altstätten Sportschützen",1,0,0,1,"Aktiv-B G10m","","B","LizenzG10m","Herr","",0,1,"25.11.2023","","","",0,"1.01.0.11.173","Zürich-Neumünster Standschützengesellschaft","","","","Aktiv","Newsletter Email","Abonnement","27.07.2023","","Nein","Nein","","","","","",1,"01.12.2023 14:27"]
["1061071","112986","Toni","Mattle","","","Klausstr. 15","9450","Altstätten SG","CH","","","071 755 40 80","079 281 74 25","toni.mattle@gmx.ch","","Männlich","19.05.1959","","Deutsch","CH","1.44.0.00.001","Altstätten Sportschützen",1,0,0,1,"Aktiv-A G10m","","A","LizenzG10m","Herr","",0,0,"01.01.2023","","","",0,"1.44.0.00.001","Altstätten Sportschützen","","","","Aktiv","Newsletter Email","","","","","Nein","","","","","","","01.12.2023 14:27"]
["1061062","112977","Ronny","Graf","","","Torkelstr. 11","9445","Rebstein","CH","","","071 777 27 14","078 611 80 13","ronny.graf@bluewin.ch","","Männlich","27.06.1974","","Deutsch","CH","1.44.0.00.001","Altstätten Sportschützen",1,0,0,1,"Aktiv-A G50m","","A","LizenzG50m","Herr","",0,0,"07.04.2017","","","",0,"1.44.0.00.001","Altstätten Sportschützen","","","","Aktiv","Newsletter Email","Abonnement","27.07.2023","","Nein","Nein","","","","","",1,"01.12.2023 14:27"]
["1060886","112801","Herbert","Schweizer","","","Sonnenhalb 3","9631","Ulisbach","CH","055 286 10 20","","071 988 26 90","079 433 77 81","hegischweizer@bluewin.ch","","Männlich","19.10.1948","","Deutsch","CH","1.44.0.00.011","Ebnat-Kappel & Umgebung Luftgewehrsektion",1,0,0,1,"Aktiv-A G10m Auflage","","A","LizenzG10m","Herr","",0,0,"01.01.2023","","","",0,"1.44.0.00.011","Ebnat-Kappel & Umgebung Luftgewehrsektion","","","","Aktiv","Newsletter Email","Abonnement","27.07.2023","","Nein","Nein","","","","","",1,"01.12.2023 14:27"]
["1134952","186872","Cédric","Besson","","","Dorfstr. 75","8248","Uhwiesen","CH","","","","079 279 93 30","besson-strasser@wein.ch","","Männlich","05.04.1979","","Französisch","CH","1.44.0.00.013","Schaffhausen Sportschützen Munot",1,0,0,1,"Aktiv-A G50m","","A","LizenzG50m","Herr","",0,1,"18.02.2006","","","",0,"1.44.0.00.013","Schaffhausen Sportschützen Munot","","","","Aktiv","Newsletter Email","","","","","Nein","","","","","","","01.12.2023 14:27"]
["1055880","107794","Markus","Brühlmann","","","Dachsenerstr. 24","8248","Uhwiesen","CH","","","052 659 44 52","079 522 58 88","bruehlmann@shinternet.ch","","Männlich","29.12.1970","756.4619.3610.80","Deutsch","CH","1.44.0.00.013","Schaffhausen Sportschützen Munot",1,0,0,1,"Aktiv-A G50m","","A","LizenzG50m","Herr","",0,1,"01.01.2023","","","",0,"1.14.0.01.045","Schaffhausen Schützengesellschaft der Stadt","","","","Aktiv","Newsletter Email","Abonnement","27.07.2023","","Nein","Nein","","","","","",1,"01.12.2023 14:27"]
["1239248","291175","Hansruedi","Fässler","","","Trubeweg 1","9533","Dietschwil","CH","","","","079 608 93 52","haru.fa@bluewin.ch","","Männlich","01.04.1971","756.1506.3521.14","Deutsch","CH","1.44.0.00.022","Kirchberg Sportschützen",1,0,0,1,"Aktiv-A G50m","","A","LizenzG50m","Herr","",0,0,"13.06.2007","","","",0,"1.17.0.10.024","Dietschwil Schützenverein","","","","Aktiv","Newsletter Email","Abonnement","27.07.2023","","Nein","Nein","","","","","",1,"01.12.2023 14:27"]
["1066499","118414","Ernst","Freimüller","","","Im Gispert 16","8457","Humlikon","CH","052 268 90 25","","052 317 27 82","079 775 42 46","e.freimueller@swissonline.ch","","Männlich","11.01.1964","","Deutsch","CH","1.44.0.00.013","Schaffhausen Sportschützen Munot",1,0,0,1,"Aktiv-A G50m","","A","LizenzG50m","Herr","",0,0,"01.07.2010","","","",0,"1.01.0.02.001","Humlikon-Adlikon Schützenverein","","","","Aktiv","Newsletter Email","Abonnement","27.07.2023","","Nein","Nein","","","","","",1,"01.12.2023 14:27"]
["1204349","256275","Patrick","Hauptmann","","","Alpsteinstr. 14","9240","Uzwil","CH","","","","079 715 79 84","patrick_hauptmann@icloud.com","","Männlich","20.05.1988","756.5998.6605.04","Deutsch","CH","1.44.0.00.022","Kirchberg Sportschützen",1,0,0,1,"Aktiv-A G50m","","A","LizenzG50m","Herr","",0,0,"10.05.2014","","","",0,"1.44.0.00.022","Kirchberg Sportschützen","","","","Aktiv","Newsletter Email","Abonnement","27.07.2023","","Nein","Nein","","","","","",1,"01.12.2023 14:27"]
["1266126","318056","Beda","Klaus","","","Hofackerweg 2","8376","Fischingen","CH","","","","","schreinerei@klosterfischingen.ch","","Männlich","17.01.1953","","Deutsch","CH","1.44.0.00.022","Kirchberg Sportschützen",1,0,0,1,"Aktiv-A G50m","","A","LizenzG50m","Herr","",0,1,"28.04.2021","","","",0,"1.44.0.00.022","Kirchberg Sportschützen","","","","Aktiv","Newsletter Email","Abonnement","27.07.2023","","Nein","Nein","","","","","",1,"01.12.2023 14:27"]
["1833718","911474","Livio","Kummer","","","Mörlerrainstr. 21","8248","Uhwiesen","CH","","","","","","","Männlich","02.02.2005","","Deutsch","CH","1.44.0.00.013","Schaffhausen Sportschützen Munot",1,0,0,1,"Aktiv-A G50m","","A","LizenzG50m","Herr","",0,1,"01.04.2018","","","",0,"1.44.0.00.013","Schaffhausen Sportschützen Munot","","","","Aktiv","","","","","","","","","","","","","01.12.2023 14:27"]
["1761920","834969","Elias","Klein","","","Rosenhügelweg 5","9533","Kirchberg","CH","","","","","","","Männlich","17.09.2003","756.7604.7743.60","Deutsch","CH","1.44.0.00.022","Kirchberg Sportschützen",1,0,0,1,"Aktiv-A G50m","","A","LizenzG50m","Herr","",0,1,"01.04.2016","","","",0,"1.44.0.00.022","Kirchberg Sportschützen","","","","Aktiv","Newsletter Email","","","","","Nein","","","","","","","01.12.2023 14:27"]
["1061223","113138","Andreas","Lenherr","","","Lehwiesweg 1","9608","Ganterschwil","CH","","","071 983 26 80","","andy.lenherr@bluewin.ch","","Männlich","24.11.1952","","Deutsch","CH","1.44.0.00.022","Kirchberg Sportschützen",1,0,0,1,"Aktiv-A G50m","","A","LizenzG50m","Herr","",0,1,"28.04.2021","","","",0,"1.44.0.00.022","Kirchberg Sportschützen","","","","Aktiv","Newsletter Email","Abonnement","27.07.2023","","Nein","Nein","","","","","",1,"01.12.2023 14:27"]
["1053650","105564","Rudolf","Büchi","","","Neue Steig 2A","9100","Herisau","CH","","","071 351 57 55","079 252 26 16","","","Männlich","16.10.1944","756.6733.5394.82","Deutsch","CH","1.44.0.00.009","Degersheim Sportschützen",1,0,0,1,"Aktiv-A G50m","","A","LizenzG50m","Herr","",0,0,"01.01.1994","","","",0,"1.15.0.00.007","Herisau Schützenverein","","","","Aktiv","Kein Newsletter","Abonnement","27.07.2023","","Nein","Nein","","","","","",1,"01.12.2023 14:27"]
["1061089","113004","Jakob","Holderegger","","","Untere Steinegg 4","9100","Herisau","CH","","","071 352 47 21","079 684 79 80","jakob.holderegger@bluewin.ch","","Männlich","09.11.1946","","Deutsch","CH","1.44.0.00.009","Degersheim Sportschützen",1,0,0,1,"Aktiv-A G50m","","A","LizenzG50m","Herr","",0,1,"01.01.2001","","","",0,"1.15.0.00.016","Stein AR Schützenverein Stein-Hundwil","","","","Aktiv","Newsletter Email","Abonnement","27.07.2023","","Nein","Nein","","","","","",1,"01.12.2023 14:27"]
["1039456","016197","Tanja","Schilliger","","","Städeliweg 5","9220","Bischofszell","CH","","","","","","","Weiblich","28.11.2010","","Deutsch","CH","1.44.0.00.007","Bischofszell Sportschützen",1,0,0,1,"Aktiv-B G10m","","B","LizenzG10m","Frau","",0,1,"01.01.2023","","","",0,"1.44.0.00.011","Ebnat-Kappel & Umgebung Luftgewehrsektion","","","","Aktiv","Newsletter Email","Abonnement","27.07.2023","","Nein","Nein","","","","","",1,"01.12.2023 14:27"]
["1060751","112666","Rolf","Aeschlimann","","","Egelseestr. 16","8570","Weinfelden","CH","","","071 622 11 85","079 660 04 25","rolf.aeschlimann@gmx.ch","","Männlich","06.08.1945","","Deutsch","CH","1.44.0.00.007","Bischofszell Sportschützen",1,0,0,1,"Aktiv-A G10m Auflage","","A","LizenzG10m","Herr","",0,0,"15.10.2016","","","",0,"1.44.0.00.007","Bischofszell Sportschützen","","","","Aktiv","Newsletter Email","Abonnement","27.07.2023","","Nein","Nein","","","","","",1,"01.12.2023 14:27"]
["1060774","112689","Marcel","Schilliger","","","Städeliweg 5","9220","Bischofszell","CH","","","071 422 43 13","078 646 77 82","mschilliger@bluewin.ch","","Männlich","26.06.1981","756.9933.3369.43","Deutsch","CH","1.44.0.00.007","Bischofszell Sportschützen",1,0,0,1,"Aktiv-A G10m","","A","LizenzG10m","Herr","praesident@ospsv.ch",0,1,"01.01.2023","","","",0,"1.44.0.00.007","Bischofszell Sportschützen","","","","Aktiv","Newsletter Email","Abonnement","27.07.2023","","Nein","Nein","","","","","",1,"01.12.2023 14:27"]
["1132142","184062","Werner","Marti","","","Dorfstr. 50","9104","Waldstatt","CH","071 351 55 44","","071 351 64 44","079 436 99 36","wernermarti@hispeed.ch","www.sg-waldstatt.ch","Männlich","18.12.1952","","Deutsch","CH","1.44.0.00.009","Degersheim Sportschützen",1,0,0,1,"Aktiv-A G50m","","A","LizenzG50m","Herr","",0,0,"01.01.2010","","","",0,"1.15.0.00.037","Waldstatt Schützengesellschaft","","","","Aktiv","Newsletter Email","Abonnement","27.07.2023","","Nein","Nein","","","","","",1,"01.12.2023 14:27"]
["1167089","219014","Adrian","Lenherr","","","Gartenstrasse 9","9473","Gams","CH","","","","","aktuar@tellgams.ch","","Männlich","18.08.1988","756.1762.5919.68","Deutsch","CH","1.44.0.00.017","Grabs Sportschützen",1,0,0,1,"Aktiv-A G10m","","A","LizenzG10m","Herr","",0,1,"01.10.2012","","","",0,"1.44.0.00.017","Grabs Sportschützen","","","","Aktiv","","","","","","","","","","","","","01.12.2023 14:27"]
["1060995","112910","Patrick","Gadient","","","Feldeggstr. 5","9470","Buchs SG","CH","","","081 740 09 75","","","","Männlich","14.10.1977","","Deutsch","CH","1.44.0.00.017","Grabs Sportschützen",1,0,0,1,"Aktiv-A G50m","","A","LizenzG50m","Herr","",0,1,"01.01.2022","","","",0,"1.44.0.00.017","Grabs Sportschützen","","","","Aktiv","Newsletter Email","Abonnement","27.07.2023","","Nein","Nein","","","","","",1,"01.12.2023 14:27"]
["1874479","954010","Raffael","Eggenberger","","","Wisli 2484","9472","Grabs","CH","","","","","","","Männlich","11.12.2007","756.3921.7094.43","Deutsch","CH","1.44.0.00.017","Grabs Sportschützen",1,0,0,1,"Aktiv-A G50m","","A","LizenzG50m","Herr","",0,1,"01.06.2023","","","",0,"1.17.0.05.038","Grabs Schützenverein","","","","Aktiv","","","","","","","","","","","","","01.12.2023 14:27"]
["1244107","296034","Martina","Scherrer","","","Schneitstr. 6","9650","Nesslau","CH","","","","","","","Weiblich","21.05.1994","","Deutsch","CH","1.44.0.00.011","Ebnat-Kappel & Umgebung Luftgewehrsektion",1,0,0,1,"Aktiv-A G10m","","A","LizenzG10m","Frau","",0,0,"01.01.2023","","","",0,"1.44.0.00.011","Ebnat-Kappel & Umgebung Luftgewehrsektion","","","","Aktiv","Newsletter Email","Abonnement","27.07.2023","","Nein","Nein","","","","","",1,"01.12.2023 14:27"]
["1060867","112782","Iwan","Hüppi","","","Felsensteinstr. 16","9642","Ebnat-Kappel","CH","","","071 565 42 72","","iwan.hueppi@bluewin.ch","","Männlich","05.10.1980","","Deutsch","CH","1.44.0.00.011","Ebnat-Kappel & Umgebung Luftgewehrsektion",1,0,0,1,"Aktiv-A G10m","","A","LizenzG10m","Herr","",0,0,"01.01.2023","","","",0,"1.44.0.00.055","Dicken Ebnat-Kappel Sportschützen","","","","Aktiv","Newsletter Email","Abonnement","27.07.2023","","Nein","Nein","","","","","",1,"01.12.2023 14:27"]
["1060889","112804","Hanspeter","Widmer","","","Bechten 1086","9613","Mühlrüti","CH","","","","079 420 13 73","hampi.widmer@bluewin.ch","","Männlich","17.03.1973","756.4190.8896.83","Deutsch","CH","1.44.0.00.011","Ebnat-Kappel & Umgebung Luftgewehrsektion",1,0,0,1,"Aktiv-A G10m","","A","LizenzG10m","Herr","",0,1,"01.01.2023","","","",0,"1.17.0.10.059","Mosnang 300m Sport Mosnang-Mühlrüti","","","","Aktiv","Newsletter Email","Abonnement","27.07.2023","","Nein","Nein","","","","","",1,"01.12.2023 14:27"]
["1060878","112793","Hansueli","Mettler","","","Gerbeweg 15","9630","Wattwil","CH","","","071 988 57 37","","humettler@bluewin.ch","","Männlich","12.12.1965","756.7892.3653.70","Deutsch","CH","1.44.0.00.011","Ebnat-Kappel & Umgebung Luftgewehrsektion",1,0,0,1,"Aktiv-A G10m Auflage","","A","LizenzG10m","Herr","",0,0,"01.01.2023","","","",0,"1.44.0.00.055","Dicken Ebnat-Kappel Sportschützen","","","","Aktiv","Newsletter Email","Abonnement","27.07.2023","","Nein","Nein","","","","","",1,"01.12.2023 14:27"]
["1060878","112793","Hansueli","Mettler","","","Gerbeweg 15","9630","Wattwil","CH","","","071 988 57 37","","humettler@bluewin.ch","","Männlich","12.12.1965","756.7892.3653.70","Deutsch","CH","1.44.0.00.011","Ebnat-Kappel & Umgebung Luftgewehrsektion",1,0,0,1,"Aktiv-A G10m","","A","LizenzG10m","Herr","",0,0,"01.01.2023","","","",0,"1.44.0.00.055","Dicken Ebnat-Kappel Sportschützen","","","","Aktiv","Newsletter Email","Abonnement","27.07.2023","","Nein","Nein","","","","","",1,"01.12.2023 14:27"]
["1039499","016240","Alessia","Santoro","","","Schrennenstr. 9","8733","Eschenbach SG","CH","","","","","","","Weiblich","16.03.2011","","Deutsch","CH","1.44.0.00.011","Ebnat-Kappel & Umgebung Luftgewehrsektion",1,0,0,1,"Aktiv-A G10m","","A","LizenzG10m","Frau","",0,1,"01.01.2023","","","",0,"1.44.0.00.011","Ebnat-Kappel & Umgebung Luftgewehrsektion","","","","Aktiv","Newsletter Email","Abonnement","27.07.2023","","Nein","Nein","","","","","",1,"01.12.2023 14:27"]
["1061056","112971","Christof","Eugster","","","Langackerweg 2","9450","Altstätten SG","CH","","","071 755 42 47","079 366 55 61","christofeugster@bluewin.ch","","Männlich","22.08.1980","","Deutsch","CH","1.44.0.00.001","Altstätten Sportschützen",1,0,0,1,"Aktiv-A G10m","","A","LizenzG10m","Herr","",0,0,"01.01.2023","","","",0,"1.44.0.00.001","Altstätten Sportschützen","","","","Aktiv","Newsletter Email","Abonnement","27.07.2023","","Nein","Nein","","","","","",1,"01.12.2023 14:27"]
["1264991","316921","Mirjam","Künzli","","","Töbeli 255","9631","Ulisbach","CH","","","","","","","Weiblich","19.05.1996","","Deutsch","CH","1.44.0.00.011","Ebnat-Kappel & Umgebung Luftgewehrsektion",1,0,0,1,"Aktiv-A G10m","","A","LizenzG10m","Frau","",0,0,"01.01.2023","","","",0,"1.44.0.00.011","Ebnat-Kappel & Umgebung Luftgewehrsektion","","","","Aktiv","Newsletter Email","Abonnement","27.07.2023","","Nein","Nein","","","","","",1,"01.12.2023 14:27"]
["1060856","112771","Daniel","Brägger","","","Schönengrundstr. 18","9104","Waldstatt","CH","","","071 994 23 29","078 893 26 52","braeggerdani@bluewin.ch","","Männlich","28.03.1972","756.0494.4254.97","Deutsch","CH","1.44.0.00.011","Ebnat-Kappel & Umgebung Luftgewehrsektion",1,0,0,1,"Aktiv-A G10m Auflage","","A","LizenzG10m","Herr","",0,0,"01.01.2023","","","",0,"1.17.0.09.057","Nesslau Schützengesellschaft","","","","Aktiv","Newsletter Email","Abonnement","27.07.2023","","Nein","Nein","","","","","",1,"01.12.2023 14:27"]
["1094005","145922","Heiri","Tschumper","","","Büel 517","9630","Wattwil","CH","","","071 988 59 28","","","","Männlich","04.02.1981","","Deutsch","CH","1.44.0.00.011","Ebnat-Kappel & Umgebung Luftgewehrsektion",1,0,0,1,"Aktiv-A G10m","","A","LizenzG10m","Herr","",0,0,"01.01.2023","","","",0,"1.44.0.00.011","Ebnat-Kappel & Umgebung Luftgewehrsektion","","","","Aktiv","Newsletter Email","Abonnement","27.07.2023","","Nein","Nein","","","","","",1,"01.12.2023 14:27"]
["1039500","016241","Maurin","Stüssi","","","Ackerhusweg 24","9642","Ebnat-Kappel","CH","","","","","","","Männlich","08.11.2010","","Deutsch","CH","1.44.0.00.011","Ebnat-Kappel & Umgebung Luftgewehrsektion",1,0,0,1,"Aktiv-A G10m","","A","LizenzG10m","Herr","",0,1,"29.09.2023","","","",0,"1.44.0.00.011","Ebnat-Kappel & Umgebung Luftgewehrsektion","","","","Aktiv","Newsletter Email","Abonnement","27.07.2023","","Nein","Nein","","","","","",1,"01.12.2023 14:27"]
["1738804","810047","Anouk","Fässler","","","Höhenweg 31","9642","Ebnat-Kappel","CH","","","","","anouk.faessler@thurweb.ch","","Weiblich","04.02.2006","","Deutsch","CH","1.44.0.00.011","Ebnat-Kappel & Umgebung Luftgewehrsektion",1,0,0,1,"Aktiv-A G10m","","A","LizenzG10m","Frau","",0,1,"01.01.2023","","","",0,"1.44.0.00.011","Ebnat-Kappel & Umgebung Luftgewehrsektion","","","","Aktiv","Newsletter Email","Abonnement","27.07.2023","","Nein","Nein","","","","","",1,"01.12.2023 14:27"]
["1188391","240317","Petra","D`Intino-Hollenstein","","","Hofstr. 7","9606","Bütschwil","CH","","","","","petra.dintino@gmail.com","","Weiblich","14.12.1989","","Deutsch","CH","1.44.0.00.011","Ebnat-Kappel & Umgebung Luftgewehrsektion",1,0,0,1,"Aktiv-A G10m","","A","LizenzG10m","Frau","",0,0,"01.01.2023","","","",0,"1.44.0.00.011","Ebnat-Kappel & Umgebung Luftgewehrsektion","","","","Aktiv","Newsletter Email","","","","","Nein","","","","","","","01.12.2023 14:27"]
["1060868","112783","Marlen","Schilliger","","","Städeliweg 5","9220","Bischofszell","CH","","","071 422 43 13","071 993 29 07","mschilliger@bluewin.ch","","Weiblich","02.10.1983","","Deutsch","CH","1.44.0.00.011","Ebnat-Kappel & Umgebung Luftgewehrsektion",1,0,0,1,"Aktiv-A G10m","","A","LizenzG10m","Frau","",0,0,"01.01.2023","","","",0,"1.44.0.00.055","Dicken Ebnat-Kappel Sportschützen","","","","Aktiv","Newsletter Email","Abonnement","27.07.2023","","Nein","Nein","","","","","",1,"01.12.2023 14:27"]
["1046134","022905","Barbara","Weishaupt-Hildebrand","","","Bahnhofstr. 1220","9643","Krummenau","CH","","","","079 561 57 07","barbara-weishaupt@bluewin.ch","","Weiblich","08.06.1986","","Deutsch","CH","1.44.0.00.011","Ebnat-Kappel & Umgebung Luftgewehrsektion",1,0,0,1,"Aktiv-A G10m","","A","LizenzG10m","Frau","",0,1,"29.09.2023","","","",0,"1.17.0.09.057","Nesslau Schützengesellschaft","","","","Aktiv","Newsletter Email","Abonnement","27.07.2023","","Nein","Nein","","","","","",1,"01.12.2023 14:27"]
["1030213","006882","Lena","Jordi","","","Howartstr. 33","9642","Ebnat-Kappel","CH","","","","","lena.jordi2010@gmail.com","","Weiblich","21.09.2010","","Deutsch","CH","1.44.0.00.011","Ebnat-Kappel & Umgebung Luftgewehrsektion",1,0,0,1,"Aktiv-A G10m","","A","LizenzG10m","Frau","",0,1,"23.09.2022","","","",0,"1.44.0.00.011","Ebnat-Kappel & Umgebung Luftgewehrsektion","","","","Aktiv","Newsletter Email","Abonnement","27.07.2023","","Nein","Nein","","","","","",1,"01.12.2023 14:27"]
["1246944","298871","Carina","Wettach","","","Lutenwilerstr.14","9650","Nesslau","CH","","","","079/3849544","carina.wettach@gmail.com","","Weiblich","18.03.1992","756.5590.8818.71","Deutsch","CH","1.44.0.00.011","Ebnat-Kappel & Umgebung Luftgewehrsektion",1,0,0,1,"Aktiv-A G10m","","A","LizenzG10m","Frau","",0,1,"29.09.2008","","","",0,"1.44.0.00.011","Ebnat-Kappel & Umgebung Luftgewehrsektion","","","","Aktiv","Newsletter Email","Abonnement","27.07.2023","","Nein","Nein","","","","","",1,"01.12.2023 14:27"]
["1061107","113022","Ursula","Schönenberger","","","Tellstr. 6","9533","Kirchberg SG","CH","079 579 12 16","","0795791216","079 579 12 16","gs@sgksv.ch","","Weiblich","12.11.1956","756.3971.6284.80","Deutsch","CH","1.44.0.00.022","Kirchberg Sportschützen",1,0,0,1,"Aktiv-A G50m","","A","LizenzG50m","Frau","schoen.u@outlook.com",0,1,"01.01.1975","","","",0,"1.44.0.00.022","Kirchberg Sportschützen","","","","Aktiv","Newsletter Email","Abonnement","27.07.2023","","Nein","Nein","","","","","",1,"01.12.2023 14:27"]
["1035845","012551","Ciril","Rohner","","","Rebbergstr. 9","9500","Wil","CH","","","","","","","Männlich","11.03.2006","","Deutsch","CH","1.44.0.00.022","Kirchberg Sportschützen",1,0,0,1,"Aktiv-A G50m","","A","LizenzG50m","Herr","",0,1,"01.01.2023","","","",0,"1.44.0.00.022","Kirchberg Sportschützen","","","","Aktiv","Newsletter Email","Abonnement","27.07.2023","","Nein","Nein","","","","","",1,"01.12.2023 14:27"]
["1898796","979452","Leonie","Amsler","","","Dorfstr. 48","8236","Büttenhardt","CH","","","","","","","Weiblich","25.09.2007","","Deutsch","CH","1.44.0.00.013","Schaffhausen Sportschützen Munot",1,0,0,1,"Aktiv-A G50m","","A","LizenzG50m","Frau","",0,1,"01.04.2020","","","",0,"1.44.0.00.013","Schaffhausen Sportschützen Munot","","","","Aktiv","","","","","","","","","","","","","01.12.2023 14:27"]
["1259721","311649","Céline","Depeder","","","Schützengasse 17","8224","Löhningen","CH","","","","076 334 02 56","celine.depeder@gmail.com","","Weiblich","01.02.1993","","Deutsch","CH","1.44.0.00.013","Schaffhausen Sportschützen Munot",1,0,0,1,"Aktiv-A G50m","","A","LizenzG50m","Frau","",0,0,"16.03.2016","","","",0,"1.44.0.00.013","Schaffhausen Sportschützen Munot","","","","Aktiv","Newsletter Email","Abonnement","27.07.2023","","Nein","Nein","","","","","",1,"01.12.2023 14:27"]
["1250734","302662","Maria","Berger","","","Hauptstr. 76","9553","Bettwiesen","CH","","","071 983 56 30","079 254 87 46","berger-m@bluewin.ch","","Weiblich","27.12.1994","","Deutsch","CH","1.44.0.00.022","Kirchberg Sportschützen",1,0,0,1,"Aktiv-A G50m","","A","LizenzG50m","Frau","",0,1,"01.01.2011","","","",0,"1.17.0.12.074","Oberrindal Militärschützenverein","","","","Aktiv","Newsletter Email","Abonnement","27.07.2023","","Nein","Nein","","","","","",1,"01.12.2023 14:27"]
["1797666","873255","Michael","Baumgartner","","","Bachtelstr. 17","8200","Schaffhausen","CH","","","","","","","Männlich","02.08.2003","","Deutsch","CH","1.44.0.00.013","Schaffhausen Sportschützen Munot",1,0,0,1,"Aktiv-A G50m","","A","LizenzG50m","Herr","",0,1,"01.04.2017","","","",0,"1.44.0.00.013","Schaffhausen Sportschützen Munot","","","","Aktiv","","","","","","","","","","","","","01.12.2023 14:27"]
["1055539","107453","Roger","Schnetzler","","","Chilchgasse 1","8214","Gächlingen","CH","","","052 681 53 38","079 684 72 08","roger.schnetzler@bluewin.ch","","Männlich","05.09.1976","756.2611.1523.78","Deutsch","CH","1.44.0.00.013","Schaffhausen Sportschützen Munot",1,0,0,1,"Aktiv-A G50m","","A","LizenzG50m","Herr","",0,1,"01.01.1991","","","",0,"1.14.0.03.015","Hallau Schützen","","","","Aktiv","Newsletter Email","","","","","Nein","","","","","","","01.12.2023 14:27"]
["1078022","129938","Ruedi","Preisig","","","Bahnhofstr. 109","8245","Feuerthalen","CH","","","052 654 32 78","","rudolf.preisig@shinternet.ch","","Männlich","02.12.1955","","Deutsch","CH","1.44.0.00.013","Schaffhausen Sportschützen Munot",1,0,0,1,"Aktiv-A G50m","","A","LizenzG50m","Herr","",0,1,"01.01.1976","","","",0,"1.44.0.00.013","Schaffhausen Sportschützen Munot","","","","Aktiv","Newsletter Email","","","","","Nein","","","","","","","01.12.2023 14:27"]
["1061097","113012","Felix","Fässler","","","Gehrenstr. 28","9556","Affeltrangen","CH","","","071 917 20 60","079 420 18 13","faesslerf@gmail.com","","Männlich","19.11.1975","","Deutsch","CH","1.44.0.00.022","Kirchberg Sportschützen",1,0,0,1,"Aktiv-A G50m","","A","LizenzG50m","Herr","",0,0,"01.01.2023","","","",0,"1.44.0.00.022","Kirchberg Sportschützen","","","","Aktiv","Newsletter Email","Abonnement","27.07.2023","","Nein","Nein","","","","","",1,"01.12.2023 14:27"]
["1743343","814747","Silvan","Lenherr","","","Neumüliweg 8","9473","Gams","CH","","","","","","","Männlich","21.12.2005","756.5141.4312.03","Deutsch","CH","1.44.0.00.017","Grabs Sportschützen",1,0,0,1,"Aktiv-A G10m","","A","LizenzG10m","Herr","",0,1,"01.02.2022","","","",0,"1.17.0.05.034","Gams Schützengesellschaft Tell","","","","Aktiv","Newsletter Email","Abonnement","27.07.2023","","Nein","Nein","","","","","",1,"01.12.2023 14:27"]
["1743338","814742","Timon","Bartholet","","","Gasenzenstrasse 12","9473","Gams","CH","","","","","","","Männlich","11.06.2004","756.3544.4843.83","Deutsch","CH","1.44.0.00.017","Grabs Sportschützen",1,0,0,1,"Aktiv-A G10m","","A","LizenzG10m","Herr","",0,1,"01.02.2022","","","",0,"1.44.0.00.017","Grabs Sportschützen","","","","Aktiv","Newsletter Email","Abonnement","27.07.2023","","Nein","Nein","","","","","",1,"01.12.2023 14:27"]
["1061017","112932","Mario","Scherrer","","","Giessenfeld 4","9469","Haag","CH","","","081 771 69 13","079 720 78 61","mario.scherrer86@gmail.com","","Männlich","05.03.1986","756.5873.8678.82","Deutsch","CH","1.44.0.00.017","Grabs Sportschützen",1,0,0,1,"Aktiv-B G50m","","B","LizenzG50m","Herr","",0,1,"01.05.2021","","","",0,"1.17.0.05.016","Buchs-Räfis Schützengesellschaft","","","","Aktiv","Newsletter Email","Abonnement","27.07.2023","","Nein","Nein","","","","","",1,"01.12.2023 14:27"]
["1074730","126646","Rolf","Raschle","","","Austr.18","9242","Oberuzwil","CH","","","071 951 07 49","078 647 54 53","rolf.raschle@gmx.ch","","Männlich","05.04.1961","","Deutsch","CH","1.44.0.00.009","Degersheim Sportschützen",1,0,0,1,"Aktiv-A G50m","","A","LizenzG50m","Herr","",0,0,"01.01.2007","","","",0,"1.44.0.00.009","Degersheim Sportschützen","","","","Aktiv","Newsletter Email","","","","","Nein","","","","","","","01.12.2023 14:27"]
["1252854","304782","René","Kaiser","","","Unterer Schleipfweg 12","9473","Gams","CH","","","081 771 13 65","","rene.kaiser@hotmail.com","","Männlich","05.11.1997","756.8646.7785.83","Deutsch","CH","1.44.0.00.017","Grabs Sportschützen",1,0,0,1,"Aktiv-A G50m","","A","LizenzG50m","Herr","",0,1,"01.01.2013","","","",0,"1.44.0.00.017","Grabs Sportschützen","","","","Aktiv","Newsletter Email","","","","","Nein","","","","","","","01.12.2023 14:27"]
["1252854","304782","René","Kaiser","","","Unterer Schleipfweg 12","9473","Gams","CH","","","081 771 13 65","","rene.kaiser@hotmail.com","","Männlich","05.11.1997","756.8646.7785.83","Deutsch","CH","1.44.0.00.017","Grabs Sportschützen",1,0,0,1,"Aktiv-A G10m","","A","LizenzG10m","Herr","",0,1,"01.10.2012","","","",0,"1.44.0.00.017","Grabs Sportschützen","","","","Aktiv","Newsletter Email","","","","","Nein","","","","","","","01.12.2023 14:27"]
["1235879","287806","Andy","Roffler","","","Altendorferstr. 47","9470","Buchs SG","CH","","","081 756 36 51","","rofflerandy@bluewin.ch","","Männlich","21.04.1956","","Deutsch","CH","1.44.0.00.017","Grabs Sportschützen",1,0,0,1,"Aktiv-B G50m","","B","LizenzG50m","Herr","",0,1,"01.05.2021","","","",0,"1.17.0.05.016","Buchs-Räfis Schützengesellschaft","","","","Aktiv","Newsletter Email","Abonnement","27.07.2023","","Nein","Nein","","","","","",1,"01.12.2023 14:27"]
["1217804","269731","Hansueli","Stricker","","","Sonnhaldenweg 4","9100","Herisau","CH","","","078 719 01 26","078 719 01 26","hansi.stricker@gmx.ch","","Männlich","10.09.1986","756.2605.1662.51","Deutsch","CH","1.44.0.00.009","Degersheim Sportschützen",1,0,0,1,"Aktiv-A G50m","","A","LizenzG50m","Herr","",0,0,"01.06.2012","","","",0,"1.15.0.00.007","Herisau Schützenverein","","","","Aktiv","Newsletter Email","Abonnement","27.07.2023","","Nein","Nein","","","","","",1,"01.12.2023 14:27"]
["1131816","183736","Hubert","Ammann","","","Gibelhalde 17A","9100","Herisau","CH","","","","079 660 30 35","hubert.ammann@hispeed.ch","","Männlich","15.06.1962","756.4212.6301.25","Deutsch","CH","1.44.0.00.009","Degersheim Sportschützen",1,0,0,1,"Aktiv-A G50m","","A","LizenzG50m","Herr","",0,0,"01.01.2012","","","",0,"1.15.0.00.037","Waldstatt Schützengesellschaft","","","","Aktiv","Newsletter Email","Abonnement","27.07.2023","","Nein","Nein","","","","","",1,"01.12.2023 14:27"]
["1901836","982549","Peter","Walser","","","Bühlstr. 8","9545","Wängi","CH","","","","","","","Männlich","29.08.1949","","Deutsch","CH","1.44.0.00.046","Wängi Sportschützen",1,0,0,1,"Aktiv-A G50m","","A","LizenzG50m","Herr","",0,1,"01.01.2023","","","",0,"1.44.0.00.046","Wängi Sportschützen","","","","Aktiv","Newsletter Email","Abonnement","27.07.2023","","Nein","Nein","","","","","",1,"01.12.2023 14:27"]
["1061648","113563","Martin","Seger","","","Eschnerstr. 12","9494","Schaan","LI","","","+42 3232 7495","079 469 41 81","","","Männlich","18.10.1976","","Deutsch","LI","1.44.0.00.059","Vaduz Sportschützen",1,0,0,1,"Aktiv-A G50m","","A","LizenzG50m","Herr","",0,1,"01.01.2023","","","",0,"1.44.0.00.059","Vaduz Sportschützen","","","","Aktiv","","","","","","","","","","","","","01.12.2023 14:27"]
["1060848","112763","Remo","Schmied","","","Haldenstr. 14","8556","Wigoltingen","CH","","","052 763 32 84","079 313 07 22","remo.schmied@planwerke.ch","","Männlich","20.01.1979","756.8892.2874.19","Deutsch","CH","1.44.0.00.010","Dettighofen Sportschützen",1,0,0,1,"Aktiv-A G50m","","A","LizenzG50m","Herr","",0,0,"01.01.2023","","","",0,"1.20.0.03.114","Schützen Heckemos","","","","Aktiv","Newsletter Email","","","","","Nein","","","","","","","01.12.2023 14:27"]
["1060889","112804","Hanspeter","Widmer","","","Bechten 1086","9613","Mühlrüti","CH","","","","079 420 13 73","hampi.widmer@bluewin.ch","","Männlich","17.03.1973","756.4190.8896.83","Deutsch","CH","1.44.0.00.028","Mosnang Sportschützen",1,0,0,1,"Aktiv-A G50m","","A","LizenzG50m","Herr","",0,1,"01.01.2023","","","",0,"1.17.0.10.059","Mosnang 300m Sport Mosnang-Mühlrüti","","","","Aktiv","Newsletter Email","Abonnement","27.07.2023","","Nein","Nein","","","","","",1,"01.12.2023 14:27"]
["1061624","113539","Otto","Büchel","","","Junkerriet 7","9496","Balzers","LI","","","+423 384 1677","","","","Männlich","09.12.1939","","Deutsch","LI","1.44.0.00.059","Vaduz Sportschützen",1,0,0,1,"Aktiv-A G50m","","A","LizenzG50m","Herr","",0,0,"01.01.2023","","","",0,"1.44.0.00.059","Vaduz Sportschützen","","","","Aktiv","Newsletter Email","Abonnement","27.07.2023","","Nein","Nein","","","","","",1,"01.12.2023 14:27"]
["1776550","850496","Oliver","Wettstein","","","Hohlgasse 4","8532","Weiningen","CH","","","052 747 23 11","079 535 31 52","oliverwettstein@gmx.ch","","Männlich","21.03.2003","756.9331.3232.62","Deutsch","CH","1.44.0.00.010","Dettighofen Sportschützen",1,0,0,1,"Aktiv-A G50m","","A","LizenzG50m","Herr","",0,1,"01.01.2023","","","",0,"1.44.0.00.010","Dettighofen Sportschützen","","","","Aktiv","Newsletter Email","Abonnement","27.07.2023","","Nein","Nein","","","","","",1,"01.12.2023 14:27"]
["1061192","113107","Rolf","Egli","","","Schulstr. 21","8543","Gundetswil","CH","","","052 375 24 93","079 454 22 63","egro.sven@bluewin.ch","","Männlich","13.05.1956","","Deutsch","CH","1.44.0.00.028","Mosnang Sportschützen",1,0,0,1,"Aktiv-A G50m","","A","LizenzG50m","Herr","",0,0,"01.01.2023","","","",0,"1.44.0.00.028","Mosnang Sportschützen","","","","Aktiv","Newsletter Email","Abonnement","27.07.2023","","Nein","Nein","","","","","",1,"01.12.2023 14:27"]
["1170969","222894","Andreas","Kuttelwascher","","","Geeren 2 / Ifwil","8362","Balterswil","CH","","","071 971 47 06","076 355 56 90","andreas.kuttelwascher@gmx.ch","","Männlich","19.08.1961","756.9231.2915.00","Deutsch","CH","1.44.0.00.046","Wängi Sportschützen",1,0,0,1,"Aktiv-A G50m","","A","LizenzG50m","Herr","",0,0,"05.06.2012","","","",0,"1.44.0.00.046","Wängi Sportschützen","","","","Aktiv","Newsletter Email","Abonnement","27.07.2023","","Nein","Nein","","","","","",1,"01.12.2023 14:27"]
["1175138","227063","Beatrix","Spuhler","","","Am Brunnen 6","5332","Rekingen","CH","","","","078 661 08 96","beatrixspuhler@gmail.ch","","Weiblich","05.04.1967","","Deutsch","CH","1.44.0.00.010","Dettighofen Sportschützen",1,0,0,1,"Aktiv-A G50m","","A","LizenzG50m","Frau","",0,0,"03.03.2004","","","",0,"1.19.0.02.075","Ehrendingen Lägernschützen Ehrendingen-Ennetbaden","","","","Aktiv","","","","","","","","","","","","","01.12.2023 14:27"]
["1740441","811737","Miguel","Carpio Santos","","","Husenstr. 10","9533","Kirchberg","CH","","","071 931 17 85","076 397 82 17","mi.carpio@hotmail.com","","Männlich","22.07.1998","756.0792.7670.84","Deutsch","CH","1.44.0.00.006","Bazenheid Sportschützen",1,0,0,1,"Aktiv-A G50m","","A","LizenzG50m","Herr","",0,0,"14.03.2014","","","",0,"1.44.0.00.006","Bazenheid Sportschützen","","","","Aktiv","Newsletter Email","Abonnement","27.07.2023","","Nein","Nein","","","","","",1,"01.12.2023 14:27"]
["1093793","145710","Fredy","Tobler","","","Fliegeneggstr. 5","9555","Tobel","CH","","","","079 203 92 31","f.tobler@sunrise.ch","","Männlich","18.04.1957","","Deutsch","CH","1.44.0.00.006","Bazenheid Sportschützen",1,0,0,1,"Aktiv-A G50m","","A","LizenzG50m","Herr","",0,0,"13.03.2010","","","",0,"1.44.0.00.006","Bazenheid Sportschützen","","","","Aktiv","Newsletter Email","Abonnement","27.07.2023","","Nein","Nein","","","","","",1,"01.12.2023 14:27"]
["1255767","307695","Hansruedi","Grob","","","Wellhauserweg 4","8500","Frauenfeld","CH","","","052 721 81 47","","","","Männlich","30.06.1944","","Deutsch","CH","1.44.0.00.006","Bazenheid Sportschützen",1,0,0,1,"Aktiv-A G50m","","A","LizenzG50m","Herr","",0,1,"11.03.2016","","","",0,"1.44.0.00.006","Bazenheid Sportschützen","","","","Aktiv","","Abonnement","27.07.2023","","Nein","","","","","","",1,"01.12.2023 14:27"]
["1911774","992742","Ralph","Gerber","","","Schweissbrunnstr. 23","9230","Flawil","CH","","","","079 860 14 73","ralphg924.rg@gmail.com","","Männlich","21.01.1967","","Deutsch","CH","1.44.0.00.006","Bazenheid Sportschützen",1,0,0,1,"Aktiv-A G50m","","A","LizenzG50m","Herr","",0,1,"01.01.2023","","","",0,"1.44.0.00.006","Bazenheid Sportschützen","","","","Aktiv","Newsletter Email","Abonnement","27.07.2023","","Nein","Nein","","","","","",1,"01.12.2023 14:27"]
["1204351","256277","Urs","Hofstetter","","","Hurnenstr.12","8360","Wallenwil","CH","","","071 971 12 39","077 479 26 58","urs.hofstetter@hotmail.com","","Männlich","02.12.1955","","Deutsch","CH","1.44.0.00.006","Bazenheid Sportschützen",1,0,0,1,"Aktiv-A G50m","","A","LizenzG50m","Herr","",0,0,"27.03.2004","","","",0,"1.44.0.00.006","Bazenheid Sportschützen","","","","Aktiv","Newsletter Email","Abonnement","27.07.2023","","Nein","Nein","","","","","",1,"01.12.2023 14:27"]
["1740445","811743","Thomas","Wiget","","","Obidörfli 14","9220","Bischofszell","CH","","","","079 898 20 98","thomwi@hotmail.com","","Männlich","19.03.1996","","Deutsch","CH","1.44.0.00.006","Bazenheid Sportschützen",1,0,0,1,"Aktiv-A G50m","","A","LizenzG50m","Herr","",0,1,"11.03.2016","","","",0,"1.44.0.00.006","Bazenheid Sportschützen","","","","Aktiv","Newsletter Email","Abonnement","27.07.2023","","Nein","Nein","","","","","",1,"01.12.2023 14:27"]
["1239060","290987","Stephan","Hildebrand","","","obere Rittbergstr. 7","9615","Dietfurt","CH","","","079 317 74 24","079 317 74 24","stephanhildebrand@bluewin.ch","","Männlich","01.06.1988","756.7903.8589.69","Deutsch","CH","1.44.0.00.006","Bazenheid Sportschützen",1,0,0,1,"Aktiv-A G50m","","A","LizenzG50m","Herr","",0,0,"02.01.2024","","","",0,"1.17.0.12.127","Wil SG Stadtschützen","","","","Aktiv","Newsletter Email","Abonnement","27.07.2023","","Nein","Nein","","","","","",1,"01.12.2023 14:27"]
["1069151","121066","Jakob","Rey","","","Rebenstr. 11","9524","Zuzwil SG","CH","","","","079 463 39 04","j.rey@bluewin.ch","","Männlich","18.06.1955","756.8754.5383.14","Deutsch","CH","1.44.0.00.006","Bazenheid Sportschützen",1,0,0,1,"Aktiv-A G50m","","A","LizenzG50m","Herr","",0,1,"01.01.2023","","","",0,"1.17.0.10.011","Bazenheid Militärschützenverein","","","","Aktiv","Newsletter Email","Abonnement","27.07.2023","","Nein","Nein","","","","","",1,"01.12.2023 14:27"]
["1683070","750190","Werner","Scherrer","","","Bergli 3","9602","Bazenheid","CH","","","","076 282 72 68","werner.scherrer@hotmail.de","","Männlich","30.04.1997","756.0603.4040.85","Deutsch","CH","1.44.0.00.006","Bazenheid Sportschützen",1,0,0,1,"Aktiv-A G50m","","A","LizenzG50m","Herr","",0,0,"15.03.2013","","","",0,"1.44.0.00.006","Bazenheid Sportschützen","","","","Aktiv","Newsletter Email","Abonnement","27.07.2023","","Nein","Nein","","","31.12.2023","","",1,"01.12.2023 14:27"]
["1061058","112973","Ramona","Eugster","","","Birkenstr. 9","9463","Oberriet SG","CH","","","071 535 75 84","","ra.eugster@bluewin.ch","","Weiblich","19.07.1983","756.4766.6644.92","Deutsch","CH","1.44.0.00.001","Altstätten Sportschützen",1,0,0,1,"Aktiv-A G50m","","A","LizenzG50m","Frau","",0,0,"07.04.2017","","","",0,"1.44.0.00.001","Altstätten Sportschützen","","","","Aktiv","Newsletter Email","","","","","Nein","","","","","","","01.12.2023 14:27"]
["1851690","930061","Roman","Geisser","","","Kapplerstr. 25","9642","Ebnat-Kappel","CH","","","","","geisserroman@gmail.com","","Männlich","17.12.2006","","Deutsch","CH","1.44.0.00.011","Ebnat-Kappel & Umgebung Luftgewehrsektion",1,0,0,1,"Aktiv-A G10m","","A","LizenzG10m","Herr","",0,1,"01.01.2023","","","",0,"1.44.0.00.011","Ebnat-Kappel & Umgebung Luftgewehrsektion","","","","Aktiv","Newsletter Email","Abonnement","27.07.2023","","Nein","Nein","","","","","",1,"01.12.2023 14:27"]
["1060866","112781","Erhard","Hüppi","","","Steinenbachstr. 22","9642","Ebnat-Kappel","CH","079 209 96 43","","071 993 29 07","079 209 96 43","erhard.hueppi@bluewin.ch","","Männlich","18.06.1954","","Deutsch","CH","1.44.0.00.011","Ebnat-Kappel & Umgebung Luftgewehrsektion",1,0,0,1,"Aktiv-A G10m","","A","LizenzG10m","Herr","erhard.hueppi@bluewin.ch",0,0,"01.01.2023","","","",0,"1.44.0.00.055","Dicken Ebnat-Kappel Sportschützen","","","","Aktiv","Newsletter Email","Abonnement","27.07.2023","","Nein","Nein","","","","","",1,"01.12.2023 14:27"]
["1814673","891334","Sandro","Bösch","","","Gantenweg 1","9642","Ebnat-Kappel","CH","","","","","","","Männlich","12.12.2004","756.4719.4446.07","Deutsch","CH","1.44.0.00.011","Ebnat-Kappel & Umgebung Luftgewehrsektion",0,0,0,1,"Aktiv-A G10m","","A","LizenzG10m","Herr","",0,1,"04.10.2017","","","",0,"1.44.0.00.011","Ebnat-Kappel & Umgebung Luftgewehrsektion","","","","Aktiv","Newsletter Email","","","","","Nein","","","29.09.2023","","","","01.12.2023 14:27"]
["1039455","016196","Vera","Lüthi","","","Büelstr. 54","9630","Wattwil","CH","","","","","","","Weiblich","17.04.2008","","Deutsch","CH","1.44.0.00.011","Ebnat-Kappel & Umgebung Luftgewehrsektion",1,0,0,1,"Aktiv-A G10m","","A","LizenzG10m","Frau","",0,1,"29.09.2023","","","",0,"1.44.0.00.011","Ebnat-Kappel & Umgebung Luftgewehrsektion","","","","Aktiv","Newsletter Email","Abonnement","27.07.2023","","Nein","Nein","","","","","",1,"01.12.2023 14:27"]
["1467717","519654","Tamara","Menzi","","","Büelstr. 54","9630","Wattwil","CH","","","","079 374 24 38","tamara.menzi@bluewin.ch","","Weiblich","09.02.1995","","Deutsch","CH","1.44.0.00.011","Ebnat-Kappel & Umgebung Luftgewehrsektion",1,0,0,1,"Aktiv-A G10m","","A","LizenzG10m","Frau","",0,1,"01.10.2010","","","",0,"1.44.0.00.011","Ebnat-Kappel & Umgebung Luftgewehrsektion","","","","Aktiv","","","","","","","","","","","","","01.12.2023 14:27"]
["1203603","255529","Hans-Ruedi","Lüthi","","","Am Iberg 1b","9630","Wattwil","CH","044 236 35 84","","056 427 09 77","079 403 38 84","harul@bluewin.ch","","Männlich","05.08.1971","","Deutsch","CH","1.44.0.00.011","Ebnat-Kappel & Umgebung Luftgewehrsektion",1,0,0,1,"Aktiv-A G10m","","A","LizenzG10m","Herr","",0,1,"01.01.2023","","","",0,"1.44.0.00.011","Ebnat-Kappel & Umgebung Luftgewehrsektion","","","","Aktiv","Newsletter Email","Abonnement","27.07.2023","","Nein","Nein","","","","","",1,"01.12.2023 14:27"]
["1040475","017222","Mia","Matter","","","Berglistr. 32b","9642","Ebnat-Kappel","CH","","","","","","","Weiblich","16.03.2012","","Deutsch","CH","1.44.0.00.011","Ebnat-Kappel & Umgebung Luftgewehrsektion",1,0,0,1,"Aktiv-A G10m","","A","LizenzG10m","Frau","",0,0,"29.09.2023","","","",0,"1.44.0.00.011","Ebnat-Kappel & Umgebung Luftgewehrsektion","","","","Aktiv","Newsletter Email","Abonnement","27.07.2023","","Nein","Nein","","","","","",1,"01.12.2023 14:27"]
["1103141","155059","Carmen","Suter","","","Hueb 74","9200","Gossau SG","CH","","","071 383 24 02","076 428 57 53","carmensuter@sunrise.ch","","Weiblich","04.04.1970","","Deutsch","CH","1.44.0.00.011","Ebnat-Kappel & Umgebung Luftgewehrsektion",1,0,0,1,"Aktiv-A G10m","","A","LizenzG10m","Frau","",0,1,"01.10.2015","","","",0,"1.17.0.01.128","Wittenbach Schützengesellschaft","","","","Aktiv","Newsletter Email","Abonnement","27.07.2023","","Nein","Nein","","","","","",1,"01.12.2023 14:27"]
["1801998","877809","Maurus","Fritsche","","","Sonnhalde 15","9050","Appenzell","CH","","","","","","","Männlich","07.05.2002","756.7837.6721.50","Deutsch","CH","1.44.0.00.002","Appenzell Luftgewehrsektion",1,0,0,1,"Aktiv-A G10m","","A","LizenzG10m","Herr","",0,0,"01.01.2023","","","",0,"1.44.0.00.050","Weissbad Sportschützen","","","","Aktiv","Newsletter Email","","","","","Nein","","","","","","","01.12.2023 14:27"]
["1873643","953115","Jonas","Manser","","","Rütistr. 47","9050","Appenzell","CH","","","","","andimanser@bluemail.ch","","Männlich","19.09.2006","","Deutsch","CH","1.44.0.00.002","Appenzell Luftgewehrsektion",1,0,0,1,"Aktiv-A G10m","","A","LizenzG10m","Herr","",0,1,"01.01.2023","","","",0,"1.44.0.00.050","Weissbad Sportschützen","","","","Aktiv","Newsletter Email","","","","","Nein","","","","","","","01.12.2023 14:27"]
["1060687","112602","Christian","Manser","","","Bilchenstr. 17","9050","Eggerstanden","CH","","","071 787 27 90","078 818 04 01","chr.manser@bluewin.ch","","Männlich","30.11.1983","756.1379.7809.60","Deutsch","CH","1.44.0.00.002","Appenzell Luftgewehrsektion",1,0,0,1,"Aktiv-A G10m","","A","LizenzG10m","Herr","",0,1,"01.01.2023","","","",0,"1.16.0.00.002","Eggerstanden, Schützenverein","","","","Aktiv","Newsletter Email","Abonnement","27.07.2023","","Nein","Nein","","","","","",1,"01.12.2023 14:27"]
["1079595","131511","Sepp","Räss","","","Bilchenstr. 22","9050","Eggerstanden","CH","","","071 787 28 67","079 205 81 33","sepp.raess@bluewin.ch","","Männlich","08.04.1966","756.8234.0483.64","Deutsch","CH","1.44.0.00.002","Appenzell Luftgewehrsektion",1,0,0,1,"Aktiv-A G10m Auflage","","A","LizenzG10m","Herr","",0,1,"01.01.2023","","","",0,"1.16.0.00.002","Eggerstanden, Schützenverein","","","","Aktiv","Newsletter Email","Abonnement","27.07.2023","","Nein","Nein","","","","","",1,"01.12.2023 14:27"]
["1822866","899889","Simon","Broger","","","Gehrenberg 24","9050","Appenzell","CH","","","","","albroger@bluewin.ch","","Männlich","18.06.2006","","Deutsch","CH","1.44.0.00.002","Appenzell Luftgewehrsektion",1,0,0,1,"Aktiv-A G10m","","A","LizenzG10m","Herr","",0,0,"01.01.2023","","","",0,"1.44.0.00.050","Weissbad Sportschützen","","","","Aktiv","","","","","","","","","","","","","01.12.2023 14:27"]
["1061490","113405","Franz","Wetter","","","Neuhüsli 16","9050","Eggerstanden","CH","","","071 787 43 80","079 436 25 20","fahrschulewetter@gmail.com","","Männlich","23.06.1958","","Deutsch","CH","1.44.0.00.002","Appenzell Luftgewehrsektion",1,0,0,1,"Aktiv-A G10m Auflage","","A","LizenzG10m","Herr","",0,1,"22.10.2020","","","",0,"1.16.0.00.002","Eggerstanden, Schützenverein","","","","Aktiv","Newsletter Email","Abonnement","27.07.2023","","Nein","Nein","","","","","",1,"01.12.2023 14:27"]
["1060706","112621","Bruno","Wyss","","","Scheregg 6","9057","Weissbad","CH","","","+41 71 799 18 22","+41 79 243 77 60","bruno.wyss@hispeed.ch","www.ospsv.ch","Männlich","05.06.1963","756.2671.4236.61","Deutsch","CH","1.44.0.00.002","Appenzell Luftgewehrsektion",1,0,0,1,"Aktiv-A G10m Auflage","","A","LizenzG10m","Herr","",0,0,"01.01.2023","","","",0,"1.16.0.00.021","Schwende, SV Uli Rotach-Schwende","","","","Aktiv","Newsletter Email","Abonnement","27.07.2023","","Nein","Nein","","","","","",1,"01.12.2023 14:27"]
["1088488","140405","Hansueli","Wyss","","","Rosengärtliweg 8","9050","Appenzell","CH","","","071 787 53 40","079/231 65 30","hasuwyss@gmx.ch","","Männlich","26.02.1963","","Deutsch","CH","1.44.0.00.002","Appenzell Luftgewehrsektion",1,0,0,1,"Aktiv-A G10m Auflage","","A","LizenzG10m","Herr","",0,0,"01.01.2023","","","",0,"1.16.0.00.021","Schwende, SV Uli Rotach-Schwende","","","","Aktiv","Newsletter Email","Abonnement","27.07.2023","","Nein","Nein","","","","","",1,"01.12.2023 14:27"]
["1084932","136849","René","Harder","","","Bachweidstr. 3B","9011","St. Gallen","CH","071 223 18 71","","071 912 16 30","079/634 26 94","rene.harder@bluewin.ch","","Männlich","05.09.1965","","Deutsch","CH","1.44.0.00.002","Appenzell Luftgewehrsektion",1,0,0,1,"Aktiv-A G10m Auflage","","A","LizenzG10m","Herr","",0,0,"05.10.2016","","","",0,"1.44.0.00.002","Appenzell Luftgewehrsektion","","","","Aktiv","Newsletter Email","Abonnement","27.07.2023","","Nein","Nein","","","","","",1,"01.12.2023 14:27"]
["1061439","113354","Beat","Eugster","","","Kapellstr. 5","9242","Oberuzwil","CH","","","","079 318 22 14","kufladenlotto@gmail.com","","Männlich","23.04.1966","","Deutsch","CH","1.44.0.00.028","Mosnang Sportschützen",1,0,0,1,"Aktiv-A G50m","","A","LizenzG50m","Herr","",0,1,"01.01.2012","","","",0,"1.44.0.00.028","Mosnang Sportschützen","","","","Aktiv","Newsletter Email","Abonnement","27.07.2023","","Nein","Nein","","","","","",1,"01.12.2023 14:27"]
["1114038","165956","Karl","Wirz","","","Rietacker 4","9548","Matzingen","CH","071 932 77 18","","052 376 17 46","078 820 19 76","karl.wirz@bluewin.ch","","Männlich","03.07.1948","","Deutsch","CH","1.44.0.00.046","Wängi Sportschützen",1,0,0,1,"Aktiv-A G50m","","A","LizenzG50m","Herr","karl.wirz@micarna.ch",0,0,"01.01.2023","","","",0,"1.20.0.04.002","Aadorf Vereinigte Schützen","","","","Aktiv","Newsletter Email","Abonnement","27.07.2023","","Nein","Nein","","","","","",1,"01.12.2023 14:27"]
["1630267","693836","Sven","Frei","","","Nelkenweg 3","8360","Wallenwil","CH","","","071971 45 61","078 975 30 55","frei-sven@bluewin.ch","","Männlich","01.10.1998","756.1866.3147.46","Deutsch","CH","1.44.0.00.046","Wängi Sportschützen",1,0,0,1,"Aktiv-A G50m","","A","LizenzG50m","Herr","",0,0,"01.01.2017","","","",0,"1.44.0.00.046","Wängi Sportschützen","","","","Aktiv","Newsletter Email","Abonnement","27.07.2023","","Nein","Nein","","","","","",1,"01.12.2023 14:27"]
["1060888","112803","André","Waser","","","Schomattenstr. 49","9630","Wattwil","CH","","","","079 504 07 63","waser1963@gmail.com","","Männlich","02.01.1963","","Deutsch","CH","1.44.0.00.028","Mosnang Sportschützen",1,0,0,1,"Aktiv-A G50m","","A","LizenzG50m","Herr","",0,1,"01.01.2012","","","",0,"1.44.0.00.028","Mosnang Sportschützen","","","","Aktiv","Newsletter Email","Abonnement","27.07.2023","","Nein","Nein","","","","","",1,"01.12.2023 14:27"]
["1060822","112737","Roland","Fröhlich","","","Lindenstr. 9","8558","Raperswilen","CH","","","052 763 26 23","","rofroehlich@bluewin.ch","","Männlich","21.09.1952","756.7026.9394.84","Deutsch","CH","1.44.0.00.010","Dettighofen Sportschützen",1,0,0,1,"Aktiv-A G50m","","A","LizenzG50m","Herr","",0,0,"01.01.2023","","","",0,"1.20.0.03.132","Raperswilen Schützengesellschaft","","","","Aktiv","Newsletter Email","","","","","Nein","","","","","","","01.12.2023 14:27"]
["1250073","302001","Armin","Eugster","","","Schulweg 6","8353","Elgg","CH","","","052 364 00 70","079 947 19 60","armineugster@bluewin.ch","www.sgelgg.ch","Männlich","16.03.1964","","Deutsch","CH","1.44.0.00.046","Wängi Sportschützen",1,0,0,1,"Aktiv-A G50m","","A","LizenzG50m","Herr","",0,1,"25.08.2022","","","",0,"1.01.0.10.042","Elgg Schützengesellschaft","","","","Aktiv","Newsletter Email","Abonnement","27.07.2023","","Nein","Nein","","","","","",1,"01.12.2023 14:27"]
["1061435","113350","Werner","Bleiker","","","Schomattenstr. 13","9630","Wattwil","CH","","","071 988 52 76","079 285 96 25","bleiker.werner@bluewin.ch","","Männlich","11.01.1959","","Deutsch","CH","1.44.0.00.028","Mosnang Sportschützen",1,0,0,1,"Aktiv-A G50m","","A","LizenzG50m","Herr","",0,1,"01.01.2012","","","",0,"1.44.0.00.028","Mosnang Sportschützen","","","","Aktiv","Newsletter Email","Abonnement","27.07.2023","","Nein","Nein","","","","","",1,"01.12.2023 14:27"]
["1061442","113357","Kurt","Hug","","","Stadtaustr. 18","9620","Lichtensteig","CH","","","071 988 48 71","","khug@gmx.ch","","Männlich","06.01.1949","756.8237.7574.54","Deutsch","CH","1.44.0.00.028","Mosnang Sportschützen",1,0,0,1,"Aktiv-A G50m","","A","LizenzG50m","Herr","",0,0,"01.01.2012","","","",0,"1.17.0.10.048","Krinau Militärschützenverein","","","","Aktiv","Newsletter Email","Abonnement","27.07.2023","","Nein","Nein","","","","","",1,"01.12.2023 14:27"]
["1061330","113245","Renato","Hausammann","","","Oberdorf 896","9651","Ennetbühl","CH","","","081 / 785 10 36","079 / 376 11 93","reno.haus@gmx.net","","Männlich","07.08.1984","","Deutsch","CH","1.44.0.00.028","Mosnang Sportschützen",1,0,0,1,"Aktiv-A G50m","","A","LizenzG50m","Herr","",0,1,"01.01.2023","","","",0,"1.44.0.00.028","Mosnang Sportschützen","","","","Aktiv","","","","","","","","","","","","","01.12.2023 14:27"]
["1060885","112800","Andreas","Schweizer","","","Husegg-Lutenwil 1490","9650","Nesslau","CH","","","071 994 12 66","077 408 68 15","praesident@sg-nesslau.ch","","Männlich","06.03.1983","756.8135.9280.24","Deutsch","CH","1.44.0.00.011","Ebnat-Kappel & Umgebung Luftgewehrsektion",1,0,0,1,"Aktiv-A G10m","","A","LizenzG10m","Herr","",0,0,"01.01.2023","","","",0,"1.17.0.09.057","Nesslau Schützengesellschaft","","","","Aktiv","Newsletter Email","Abonnement","27.07.2023","","Nein","Nein","","","","","",1,"01.12.2023 14:27"]
["1202336","254262","Ignaz","Nachbaur","","","Anna-Henselerstr. 30","6833","Klaus","AT","","","","","","","Männlich","24.01.1966","","Deutsch","CH","1.44.0.00.011","Ebnat-Kappel & Umgebung Luftgewehrsektion",1,0,0,1,"Aktiv-A G10m Auflage","","A","LizenzG10m","Herr","",0,0,"01.01.2023","","","",0,"1.44.0.00.011","Ebnat-Kappel & Umgebung Luftgewehrsektion","","","","Aktiv","Newsletter Email","Abonnement","27.07.2023","18.09.2023","Nein","Nein","","","","","",1,"01.12.2023 14:27"]
["1202336","254262","Ignaz","Nachbaur","","","Anna-Henselerstr. 30","6833","Klaus","AT","","","","","","","Männlich","24.01.1966","","Deutsch","CH","1.44.0.00.011","Ebnat-Kappel & Umgebung Luftgewehrsektion",1,0,0,1,"Aktiv-A G10m","","A","LizenzG10m","Herr","",0,0,"01.01.2023","","","",0,"1.44.0.00.011","Ebnat-Kappel & Umgebung Luftgewehrsektion","","","","Aktiv","Newsletter Email","Abonnement","27.07.2023","18.09.2023","Nein","Nein","","","","","",1,"01.12.2023 14:27"]
["1855969","934456","Ian","Künzli","","","Howartstr. 22","9642","Ebnat-Kappel","CH","","","","","","","Männlich","15.07.2006","","Deutsch","CH","1.44.0.00.011","Ebnat-Kappel & Umgebung Luftgewehrsektion",1,0,0,1,"Aktiv-A G10m","","A","LizenzG10m","Herr","",0,0,"06.12.2018","","","",0,"1.44.0.00.011","Ebnat-Kappel & Umgebung Luftgewehrsektion","","","","Aktiv","Newsletter Email","Abonnement","27.07.2023","","Nein","Nein","","","","","",1,"01.12.2023 14:27"]
["1082082","133999","Jakob","Schweizer","","","Husegg Lutenwil 1490","9650","Nesslau","CH","","","071 994 22 74","","jakob-schweizer@bluewin.ch","","Männlich","22.04.1947","756.8265.0990.14","Deutsch","CH","1.44.0.00.011","Ebnat-Kappel & Umgebung Luftgewehrsektion",1,0,0,1,"Aktiv-A G10m Auflage","","A","LizenzG10m","Herr","",0,1,"01.01.2023","","","",0,"1.17.0.09.057","Nesslau Schützengesellschaft","","","","Aktiv","Newsletter Email","Abonnement","27.07.2023","","Nein","Nein","","","","","",1,"01.12.2023 14:27"]
["1039456","016197","Tanja","Schilliger","","","Städeliweg 5","9220","Bischofszell","CH","","","","","","","Weiblich","28.11.2010","","Deutsch","CH","1.44.0.00.011","Ebnat-Kappel & Umgebung Luftgewehrsektion",1,0,0,1,"Aktiv-A G10m","","A","LizenzG10m","Frau","",0,1,"23.10.2022","","","",0,"1.44.0.00.011","Ebnat-Kappel & Umgebung Luftgewehrsektion","","","","Aktiv","Newsletter Email","Abonnement","27.07.2023","","Nein","Nein","","","","","",1,"01.12.2023 14:27"]
["1857020","935555","Jenny","Mosch","","","Hub 17","9463","Oberriet SG","CH","","","071 761 31 70","","andy.mosch@bluewin.ch","","Weiblich","07.03.2006","756.1382.8683.96","Deutsch","CH","1.44.0.00.001","Altstätten Sportschützen",1,0,0,1,"Aktiv-A G10m","","A","LizenzG10m","Frau","",0,0,"25.10.2021","","","",0,"1.44.0.00.001","Altstätten Sportschützen","","","","Aktiv","Newsletter Email","","","","","Nein","","","","","","","01.12.2023 14:27"]
["1060883","112798","Franco","Santoro","SFS Santoro Financial Services","","Schrennenstr. 9","8733","Eschenbach SG","CH","055 535 03 03","","","078 790 23 65","franco.santoro@gmx.ch","","Männlich","18.01.1971","","Deutsch","CH","1.44.0.00.011","Ebnat-Kappel & Umgebung Luftgewehrsektion",0,0,0,1,"Aktiv-A G10m","","A","LizenzG10m","Herr","",0,0,"01.01.2023","","","",0,"1.44.0.00.055","Dicken Ebnat-Kappel Sportschützen","","","","Aktiv","Newsletter Email","","","","","Nein","","","16.10.2023","","","","01.12.2023 14:27"]
["1061199","113114","Albin","Meier","","","Obere Rittbergstr. 2","9615","Dietfurt","CH","071 987 41 72","","071 988 45 03","079 484 80 53","albin.meier@bluewin.ch","","Männlich","31.08.1957","756.5506.2774.77","Deutsch","CH","1.44.0.00.028","Mosnang Sportschützen",1,0,0,1,"Aktiv-A G50m","","A","LizenzG50m","Herr","",0,0,"01.01.2023","","","",0,"1.44.0.00.028","Mosnang Sportschützen","","","","Aktiv","Newsletter Email","Abonnement","27.07.2023","","Nein","Nein","","","","","",1,"01.12.2023 14:27"]
["1061475","113390","Roger","Schmied","","","Bettackerstr. 18","8556","Wigoltingen","CH","","","","079 463 57 57","roger.schmied@mobiliar.ch","","Männlich","15.01.1978","756.9703.7263.49","Deutsch","CH","1.44.0.00.010","Dettighofen Sportschützen",1,0,0,1,"Aktiv-A G50m","","A","LizenzG50m","Herr","",0,0,"06.03.2008","","","",0,"1.20.0.03.114","Schützen Heckemos","","","","Aktiv","Newsletter Email","Abonnement","27.07.2023","","Nein","Nein","","","","","",1,"01.12.2023 14:27"]
["1061632","113547","Dietmar","Kindle","","","Feldstr. 15","9495","Triesen","LI","","","+42 3392 1508","","","","Männlich","21.12.1951","","Deutsch","LI","1.44.0.00.059","Vaduz Sportschützen",1,0,0,1,"Aktiv-A G50m","","A","LizenzG50m","Herr","",0,1,"01.01.2023","","","",0,"1.44.0.00.059","Vaduz Sportschützen","","","","Aktiv","Newsletter Email","Abonnement","27.07.2023","","Nein","Nein","","","","","",1,"01.12.2023 14:27"]
["1111299","163217","Nelly","Ganz","","","Riedhofstr. 90","8408","Winterthur","CH","","","052 222 42 79","","nellyganz291@gmail.com","","Weiblich","29.01.1948","","Deutsch","CH","1.44.0.00.010","Dettighofen Sportschützen",1,0,0,1,"Aktiv-A G50m","","A","LizenzG50m","Frau","",0,1,"04.03.2009","","","",0,"1.44.0.00.010","Dettighofen Sportschützen","","","","Aktiv","Newsletter Email","","","","","Nein","","","","","","","01.12.2023 14:27"]
["1229492","281419","Christian","Kessler","","","Thurfeldstr. 28","8570","Weinfelden","CH","","","071 622 49 76","","chrigi.kessler@outlook.com","","Männlich","29.09.1988","756.9487.8036.25","Deutsch","CH","1.44.0.00.010","Dettighofen Sportschützen",1,0,0,1,"Aktiv-A G50m","","A","LizenzG50m","Herr","kessler.christian@sgweinfelden.ch",0,0,"31.03.2011","","","",0,"1.20.0.08.179","Weinfelden Schützengesellschaft","","","","Aktiv","Newsletter Email","","","","","Nein","","","","","","","01.12.2023 14:27"]
["1060880","112795","Philipp","Metzger","","","Hauptstr. 11","9650","Nesslau","CH","079 338 59 89","","071 994 18 16","079 359 15 43","info@metzger-metzger.ch","","Männlich","28.03.1977","","Deutsch","CH","1.44.0.00.028","Mosnang Sportschützen",1,0,0,1,"Aktiv-A G50m","","A","LizenzG50m","Herr","",0,0,"01.01.2023","","","",0,"1.44.0.00.028","Mosnang Sportschützen","","","","Aktiv","Newsletter Email","Abonnement","27.07.2023","","Nein","Nein","","","","","",1,"01.12.2023 14:27"]
["1150115","202038","Josef","Baumann","","","Ritzentaa 2195","9615","Diefurt","CH","","","","079 831 08 65","baumann.sepp@bluewin.ch","","Männlich","16.04.1969","756.6013.4397.92","Deutsch","CH","1.44.0.00.028","Mosnang Sportschützen",1,0,0,1,"Aktiv-A G50m","","A","LizenzG50m","Herr","",0,0,"01.01.2023","","","",0,"1.17.0.10.059","Mosnang 300m Sport Mosnang-Mühlrüti","","","","Aktiv","Newsletter Email","Abonnement","27.07.2023","","Nein","Nein","","","","","",1,"01.12.2023 14:27"]
["1184221","236147","Benny","Schneider","","","Sonnhaldenstr. 7","8362","Balterswil","CH","","","071 971 16 23","076 537 68 00","benny.001@bluewin.ch","","Männlich","13.04.1961","","Deutsch","CH","1.44.0.00.046","Wängi Sportschützen",1,0,0,1,"Aktiv-A G50m","","A","LizenzG50m","Herr","",0,1,"11.05.2014","","","",0,"1.20.0.06.015","Balterswil-Ifwil Schützengesellschaft","","","","Aktiv","Newsletter Email","Abonnement","27.07.2023","","Nein","Nein","","","","","",1,"01.12.2023 14:27"]
["1870315","949648","Patrick","Büchel","","","Peter und Paul Str. 44","9493","Mauren","LI","","","","","","","Männlich","19.02.1997","","Deutsch","LI","1.44.0.00.059","Vaduz Sportschützen",1,0,0,1,"Aktiv-A G50m","","A","LizenzG50m","Herr","",0,1,"01.01.2023","","","",0,"1.44.0.00.059","Vaduz Sportschützen","","","","Aktiv","Newsletter Email","Abonnement","27.07.2023","","Nein","Nein","","","","","",1,"01.12.2023 14:27"]
["1235489","287416","René","Bürge","","","Böhlisjockes 10","9057","Weissbad","CH","","","071 799 17 89","079 601 08 06","1669eb@gmail.com","","Männlich","15.09.1968","","Deutsch","CH","1.44.0.00.002","Appenzell Luftgewehrsektion",1,0,0,1,"Aktiv-A G10m","","A","LizenzG10m","Herr","",0,1,"15.10.2014","","","",0,"1.17.0.01.170","Gossau SG Sportschützen","","","","Aktiv","Newsletter Email","Abonnement","27.07.2023","","Nein","Nein","","","","","",1,"01.12.2023 14:27"]
["1088494","140411","Bruno","Manser","","","Böhlisjockes 36","9057","Weissbad","CH","","","071 799 11 68","078 934 87 17","manser.bruno@bluewin.ch","","Männlich","31.08.1950","","Deutsch","CH","1.44.0.00.002","Appenzell Luftgewehrsektion",1,0,0,1,"Aktiv-A G10m Auflage","","A","LizenzG10m","Herr","",0,0,"01.01.2023","","","",0,"1.16.0.00.021","Schwende, SV Uli Rotach-Schwende","","","","Aktiv","Newsletter Email","","","","","Nein","","","","","","","01.12.2023 14:27"]
["1088059","139976","Albert","Manser","","","Alte Sägestr. 2","9050","Eggerstanden","CH","","","071 787 27 90","077 490 85 90","av.manser@outlook.com","","Männlich","09.04.1951","","Deutsch","CH","1.44.0.00.002","Appenzell Luftgewehrsektion",1,0,0,1,"Aktiv-A G10m Auflage","","A","LizenzG10m","Herr","",0,1,"01.01.2023","","","",0,"1.16.0.00.002","Eggerstanden, Schützenverein","","","","Aktiv","Newsletter Email","Abonnement","27.07.2023","","Nein","Nein","","","","","",1,"01.12.2023 14:27"]
["1088059","139976","Albert","Manser","","","Alte Sägestr. 2","9050","Eggerstanden","CH","","","071 787 27 90","077 490 85 90","av.manser@outlook.com","","Männlich","09.04.1951","","Deutsch","CH","1.44.0.00.002","Appenzell Luftgewehrsektion",1,0,0,1,"Aktiv-A G10m","","A","LizenzG10m","Herr","",0,1,"29.10.1982","","","",0,"1.16.0.00.002","Eggerstanden, Schützenverein","","","","Aktiv","Newsletter Email","Abonnement","27.07.2023","","Nein","Nein","","","","","",1,"01.12.2023 14:27"]
["1060697","112612","Marco","Sonderer","","","Gaiserstr. 25","9050","Appenzell","CH","","","","078 727 89 86","marco.sonderer@elektro-sonderer.ch","","Männlich","20.07.1979","756.4816.9330.35","Deutsch","CH","1.44.0.00.002","Appenzell Luftgewehrsektion",1,0,0,1,"Aktiv-A G10m","","A","LizenzG10m","Herr","",0,1,"01.01.2023","","","",0,"1.16.0.00.003","Ried, Infanterieschützenverein Appenzell","","","","Aktiv","Newsletter Email","Abonnement","27.07.2023","","Nein","Nein","","","","","",1,"01.12.2023 14:27"]
["1060691","112606","Stefan","Manser","","","Dorfstr. 17","9050","Appenzell Eggerstanden","CH","","","071 787 27 90","","info@stefan-manser.ch","","Männlich","31.01.1986","756.0331.9028.91","Deutsch","CH","1.44.0.00.002","Appenzell Luftgewehrsektion",1,0,0,1,"Aktiv-A G10m","","A","LizenzG10m","Herr","",0,1,"01.01.2023","","","",0,"1.16.0.00.002","Eggerstanden, Schützenverein","","","","Aktiv","Newsletter Email","Abonnement","27.07.2023","","Nein","Nein","","","","","",1,"01.12.2023 14:27"]
["1867918","947117","Elischa","Rochira","","","Stompes 5","9050","Appenzell Steinegg","CH","","","","079 660 93 88","","","Männlich","04.09.2007","","Deutsch","CH","1.44.0.00.002","Appenzell Luftgewehrsektion",1,0,0,1,"Aktiv-A G10m","","A","LizenzG10m","Herr","",0,0,"15.02.2023","","","",0,"1.44.0.00.002","Appenzell Luftgewehrsektion","","","","Aktiv","Newsletter Email","","","","","Nein","","","","","","","01.12.2023 14:27"]
["1142124","194045","Anton","Zihlmann","","","Kelhofstr. 30","8599","Salmsach","CH","","","","078 927 90 12","to.zihl@hotmail.com","","Männlich","21.07.1962","756.6795.1816.98","Deutsch","CH","1.44.0.00.012","Egnach Sportschützen",1,0,0,1,"Aktiv-A G50m","","A","LizenzG50m","Herr","",0,1,"01.01.2013","","","",0,"1.44.0.00.012","Egnach Sportschützen","","","","Aktiv","Newsletter Email","Abonnement","27.07.2023","","Nein","Nein","","","","","",1,"01.12.2023 14:27"]
["1060908","112823","Hans","Steiner","","","Amriswilerstr. 36","9314","Steinebrunn","CH","","","0714772159","0799136016","h-a.steiner@bluewin.ch","","Männlich","17.06.1952","","Deutsch","CH","1.44.0.00.012","Egnach Sportschützen",1,0,0,1,"Aktiv-A G50m","","A","LizenzG50m","Herr","",0,1,"01.01.1998","","","",0,"1.44.0.00.012","Egnach Sportschützen","","","","Aktiv","Newsletter Email","Abonnement","27.07.2023","","Nein","Nein","","","","","",1,"01.12.2023 14:27"]
["1138593","190513","Emil","Senn","","","Mettlenstr. 5","9523","Züberwangen","CH","","","071 944 10 87","079 207 83 24","metax.senn@bluewin.ch","","Männlich","29.01.1947","","Deutsch","CH","1.44.0.00.006","Bazenheid Sportschützen",1,0,0,1,"Aktiv-A G50m","","A","LizenzG50m","Herr","",0,1,"01.01.2023","","","",0,"1.17.0.10.114","Tannen Militärschützenverein","","","","Aktiv","Newsletter Email","Abonnement","27.07.2023","","Nein","Nein","","","","","",1,"01.12.2023 14:27"]
["1060749","112664","Bruno","Ursprung","","","Bahnhofstr. 25","9553","Bettwiesen","CH","","","","076 315 77 42","","","Männlich","09.05.1965","","Deutsch","CH","1.44.0.00.006","Bazenheid Sportschützen",1,0,0,1,"Aktiv-A G50m","","A","LizenzG50m","Herr","",0,1,"01.01.2023","","","",0,"1.44.0.00.006","Bazenheid Sportschützen","","","","Aktiv","Newsletter Email","Abonnement","27.07.2023","","Nein","Nein","","","","","",1,"01.12.2023 14:27"]
["1061228","113143","Norbert","Werz","","","Oberdorfstr. 9","9532","Rickenbach b. Wil","CH","","","071 923 43 28","079 445 16 56","norbert.werz@bluewin.ch","","Männlich","09.04.1956","","Deutsch","CH","1.44.0.00.006","Bazenheid Sportschützen",1,0,0,1,"Aktiv-A G50m","","A","LizenzG50m","Herr","",0,1,"01.01.2023","","","",0,"1.17.0.10.114","Tannen Militärschützenverein","","","","Aktiv","Newsletter Email","Abonnement","27.07.2023","","Nein","Nein","","","","","",1,"01.12.2023 14:27"]
["1683565","750732","Pavel","Müller","","","Storchenacker 4","8574","Lengwil-Oberhofen","CH","","","+41 71 633 12","","","","Männlich","14.08.1997","756.5210.2942.10","Deutsch","CH","1.44.0.00.025","Lengwil Sportschützen",1,0,0,1,"Aktiv-A G50m","","A","LizenzG50m","Herr","pavel.mueller@bluewin.ch",0,0,"05.04.2014","","","",0,"1.44.0.00.025","Lengwil Sportschützen","","","","Aktiv","Newsletter Email","Abonnement","27.07.2023","","Nein","Nein","","","","","",1,"01.12.2023 14:27"]
["1673214","739628","Luca","Pompeo","","","Im Brünler 4","8525","Niederneunforn","CH","","","052 740 22 66","078 628 88 90","lucapompeo@hispeed.ch","","Männlich","16.07.1998","","Deutsch","CH","1.44.0.00.014","Neunforn Sportschützen",1,0,0,1,"Aktiv-A G50m","","A","LizenzG50m","Herr","",0,1,"01.01.2022","","","",0,"1.44.0.00.014","Neunforn Sportschützen","","","","Aktiv","","","","","","","","","","","","","01.12.2023 14:27"]
["1704453","772919","Yvonne","Bodenmann","","","Schäfliwis 17","9104","Waldstatt","CH","","","071 350 06 71","078 894 98 25","hans-bodenmann@bluewin.ch","","Weiblich","19.02.1980","","Deutsch","CH","1.44.0.00.006","Bazenheid Sportschützen",1,0,0,1,"Aktiv-A G50m","","A","LizenzG50m","Frau","",0,1,"13.03.2015","","","",0,"1.44.0.00.006","Bazenheid Sportschützen","","","","Aktiv","Newsletter Email","Abonnement","27.07.2023","","Nein","Nein","","","","","",1,"01.12.2023 14:27"]
["1060750","112665","Karl","Ursprung","","","Höhenweg 8","8586","Riedt b. Erlen","CH","","","071 648 27 36","077 421 27 05","karl.ursprung62@gmail.com","","Männlich","11.05.1962","","Deutsch","CH","1.44.0.00.006","Bazenheid Sportschützen",1,0,0,1,"Aktiv-A G50m","","A","LizenzG50m","Herr","",0,1,"01.01.2023","","","",0,"1.44.0.00.006","Bazenheid Sportschützen","","","","Aktiv","Newsletter Email","Abonnement","27.07.2023","","Nein","Nein","","","","","",1,"01.12.2023 14:27"]
["1199921","251847","Josef","Brand","","","Bahnhofstr. 6","8574","Lengwil","CH","","","071 688 26 59","","","","Männlich","14.02.1939","","Deutsch","CH","1.44.0.00.025","Lengwil Sportschützen",1,0,0,1,"Aktiv-A G50m","","A","LizenzG50m","Herr","",0,1,"01.01.2023","","","",0,"1.44.0.00.025","Lengwil Sportschützen","","","","Aktiv","","Abonnement","27.07.2023","","Nein","","","","","","",1,"01.12.2023 14:27"]
["1633584","697499","Tamara","Hildebrand","","","Husenstr. 10","9533","Kirchberg","CH","","","","079 904 62 82","tamarahildebrand@bluewin.ch","","Weiblich","06.08.2001","756.5157.2154.22","Deutsch","CH","1.44.0.00.006","Bazenheid Sportschützen",1,0,0,1,"Aktiv-B G50m","","B","LizenzG50m","Frau","",0,0,"01.01.2023","","","",0,"1.17.0.12.127","Wil SG Stadtschützen","","","","Aktiv","Newsletter Email","","","","","Nein","","","","","","","01.12.2023 14:27"]
["1060883","112798","Franco","Santoro","SFS Santoro Financial Services","","Schrennenstr. 9","8733","Eschenbach SG","CH","055 535 03 03","","","078 790 23 65","franco.santoro@gmx.ch","","Männlich","18.01.1971","","Deutsch","CH","1.44.0.00.011","Ebnat-Kappel & Umgebung Luftgewehrsektion",1,0,0,1,"Aktiv-A G10m Auflage","","A","LizenzG10m","Herr","",0,0,"01.04.2022","","","",0,"1.44.0.00.055","Dicken Ebnat-Kappel Sportschützen","","","","Aktiv","Newsletter Email","","","","","Nein","","","","","","","01.12.2023 14:27"]
["1220887","272814","Heinz","Bösch","","","Wisli 265","9655","Stein SG","CH","","","","079 343 81 45","thboesch@bluewin.ch","","Männlich","25.04.1956","","Deutsch","CH","1.44.0.00.011","Ebnat-Kappel & Umgebung Luftgewehrsektion",1,0,0,1,"Aktiv-A G10m","","A","LizenzG10m","Herr","",0,0,"01.01.2023","","","",0,"1.17.0.09.089","Stein SG Schützenverein","","","","Aktiv","Newsletter Email","Abonnement","27.07.2023","","Nein","Nein","","","","","",1,"01.12.2023 14:27"]
["1060870","112785","Hanspeter","Künzli","","","Howartstr. 33","9642","Ebnat-Kappel","CH","","","071 993 29 16","079 815 69 60","hanspeterkuenzli@thurweb.ch","","Männlich","06.04.1967","756.3605.1740.17","Deutsch","CH","1.44.0.00.011","Ebnat-Kappel & Umgebung Luftgewehrsektion",1,0,0,1,"Aktiv-A G10m Auflage","","A","LizenzG10m","Herr","",0,0,"01.01.2023","","","",0,"1.44.0.00.055","Dicken Ebnat-Kappel Sportschützen","","","","Aktiv","","Abonnement","27.07.2023","","Nein","","","","","","",1,"01.12.2023 14:27"]
["1060855","112770","Urs","Bösch","","","Stationsstr. 9a","8630","Wallenwil","CH","","","","077 406 54 22","uboesch84@gmail.com","www.lgek.ch","Männlich","27.05.1984","756.5780.3185.38","Deutsch","CH","1.44.0.00.011","Ebnat-Kappel & Umgebung Luftgewehrsektion",1,0,0,1,"Aktiv-A G10m","","A","LizenzG10m","Herr","",0,0,"01.01.2023","","","",0,"1.44.0.00.011","Ebnat-Kappel & Umgebung Luftgewehrsektion","","","","Aktiv","Newsletter Email","Abonnement","27.07.2023","","Nein","Nein","","","","","",1,"01.12.2023 14:27"]
["1139873","191793","Walter","Lusti","","","Boden 1837","9651","Ennetbühl","CH","","","071 994 18 12","079 601 17 48","walter.lusti@gmail.com","","Männlich","02.11.1948","756.7241.8688.42","Deutsch","CH","1.44.0.00.011","Ebnat-Kappel & Umgebung Luftgewehrsektion",1,0,0,1,"Aktiv-A G10m Auflage","","A","LizenzG10m","Herr","",0,0,"01.01.2023","","","",0,"1.17.0.09.057","Nesslau Schützengesellschaft","","","","Aktiv","Newsletter Email","Abonnement","27.07.2023","","Nein","Nein","","","","","",1,"01.12.2023 14:27"]
["1035923","012631","Alexandra","Ebenhoch","","","Sonnengarten 5013","6973","Höchst","AT","","","+43 67761720304","","alexandra.ebenhoch@gmail.com","","Weiblich","12.10.1969","","Deutsch","AT","1.44.0.00.011","Ebnat-Kappel & Umgebung Luftgewehrsektion",1,0,0,1,"Aktiv-A G10m Auflage","","A","LizenzG10m","Frau","",0,1,"01.04.2022","","","",0,"1.44.0.00.011","Ebnat-Kappel & Umgebung Luftgewehrsektion","","","","Aktiv","Newsletter Email","Abonnement","27.07.2023","18.09.2023","Nein","Nein","","","","","",1,"01.12.2023 14:27"]
["1060871","112786","Markus","Künzli","","","Howartstr. 22","9642","Ebnat-Kappel","CH","","","071 993 21 10","","aktuar@kkdicken.ch","","Männlich","10.05.1974","","Deutsch","CH","1.44.0.00.011","Ebnat-Kappel & Umgebung Luftgewehrsektion",1,0,0,1,"Aktiv-A G10m","","A","LizenzG10m","Herr","",0,0,"01.01.2023","","","",0,"1.44.0.00.055","Dicken Ebnat-Kappel Sportschützen","","","","Aktiv","Newsletter Email","Abonnement","27.07.2023","","Nein","Nein","","","","","",1,"01.12.2023 14:27"]
["1060871","112786","Markus","Künzli","","","Howartstr. 22","9642","Ebnat-Kappel","CH","","","071 993 21 10","","aktuar@kkdicken.ch","","Männlich","10.05.1974","","Deutsch","CH","1.44.0.00.011","Ebnat-Kappel & Umgebung Luftgewehrsektion",1,0,0,1,"Aktiv-A G10m Auflage","","A","LizenzG10m","Herr","",0,0,"01.01.2023","","","",0,"1.44.0.00.055","Dicken Ebnat-Kappel Sportschützen","","","","Aktiv","Newsletter Email","Abonnement","27.07.2023","","Nein","Nein","","","","","",1,"01.12.2023 14:27"]
["1864996","944042","Adrian","Kramer","","","Höhe 1532","9469","Haag (Rheintal)","CH","","","","","","","Männlich","11.04.2006","756.5037.2194.89","Deutsch","CH","1.44.0.00.017","Grabs Sportschützen",1,0,0,1,"Aktiv-A G10m","","A","LizenzG10m","Herr","",0,0,"01.01.2023","","","",0,"1.44.0.00.017","Grabs Sportschützen","","","","Aktiv","Newsletter Email","Abonnement","27.07.2023","","Nein","Nein","","","","","",1,"01.12.2023 14:27"]
["1619955","682582","Marlies","Kaiser","","","Wiedenstr. 40","9470","Buchs","CH","","","081 771 13 65","079 842 92 77","","","Weiblich","29.04.1999","","Deutsch","CH","1.44.0.00.017","Grabs Sportschützen",1,0,0,1,"Aktiv-A G50m","","A","LizenzG50m","Frau","",0,0,"01.01.2012","","","",0,"1.44.0.00.017","Grabs Sportschützen","","","","Aktiv","Newsletter Email","Abonnement","27.07.2023","","Nein","Nein","","","","","",1,"01.12.2023 14:27"]
["1619955","682582","Marlies","Kaiser","","","Wiedenstr. 40","9470","Buchs","CH","","","081 771 13 65","079 842 92 77","","","Weiblich","29.04.1999","","Deutsch","CH","1.44.0.00.017","Grabs Sportschützen",1,0,0,1,"Aktiv-A G10m","","A","LizenzG10m","Frau","",0,0,"01.10.2012","","","",0,"1.44.0.00.017","Grabs Sportschützen","","","","Aktiv","Newsletter Email","Abonnement","27.07.2023","","Nein","Nein","","","","","",1,"01.12.2023 14:27"]
["1148715","200637","Andreas","Diem","","","Urnäscherstr. 30","9104","Waldstatt","CH","","","071 351 24 85","079 412 34 22","diem.a@bluewin.ch","","Männlich","29.06.1968","756.9523.1968.34","Deutsch","CH","1.44.0.00.009","Degersheim Sportschützen",1,0,0,1,"Aktiv-A G50m","","A","LizenzG50m","Herr","",0,0,"01.08.2005","","","",0,"1.15.0.00.023","Schwellbrunn Feldschützen","","","","Aktiv","Newsletter Email","Abonnement","27.07.2023","","Nein","Nein","","","","","",1,"01.12.2023 14:27"]
["1060998","112913","Ulrich","Gantenbein","","","Dorfstr. 12","9472","Grabs","CH","","","081 771 34 95","","u_r_gantenbein@bluewin.ch","","Männlich","30.06.1949","756.3727.4953.28","Deutsch","CH","1.44.0.00.017","Grabs Sportschützen",0,0,0,1,"Aktiv-A G50m","","A","LizenzG50m","Herr","",0,0,"01.01.2000","","","",0,"1.44.0.00.017","Grabs Sportschützen","","","","Aktiv","Newsletter Email","Abonnement","27.07.2023","","Nein","Nein","","","31.12.2022","","",1,"01.12.2023 14:27"]
["1061090","113005","Roland","Mettler","","","hintere Haldenstr. 8","9633","Bächli (Hemberg)","CH","","","071 377 14 35","079 330 36 41","rmettler@bluewin.ch","","Männlich","09.06.1955","","Deutsch","CH","1.44.0.00.009","Degersheim Sportschützen",1,0,0,1,"Aktiv-A G50m","","A","LizenzG50m","Herr","",0,0,"01.01.1980","","","",0,"1.17.0.10.010","Wattwil Sportschützen Krummbach-Hemberg","","","","Aktiv","Newsletter Email","Abonnement","27.07.2023","","Nein","Nein","","","","","",1,"01.12.2023 14:27"]
["1888730","968886","Josipa","Matanovic","","","Schützenweg 13","9470","Buchs SG","CH","","","081 756 76 55","o78 876 65 75","","","Weiblich","03.03.2007","","Deutsch","CH","1.44.0.00.017","Grabs Sportschützen",1,0,0,1,"Aktiv-A G50m","","A","LizenzG50m","Frau","",0,1,"01.06.2023","","","",0,"1.44.0.00.017","Grabs Sportschützen","","","","Aktiv","Newsletter Email","Abonnement","27.07.2023","","Nein","Nein","","","","","",1,"01.12.2023 14:27"]
["1477535","529472","Martina","Kaiser","","","Alvierstr. 11","9470","Buchs","CH","","","081 771 13 65","","kaiser.martina@hotmail.com","","Weiblich","15.03.1996","","Deutsch","CH","1.44.0.00.017","Grabs Sportschützen",1,0,0,1,"Aktiv-A G50m","","A","LizenzG50m","Frau","",0,1,"01.01.2011","","","",0,"1.44.0.00.017","Grabs Sportschützen","","","","Aktiv","Newsletter Email","Abonnement","27.07.2023","","Nein","Nein","","","","","",1,"01.12.2023 14:27"]
["1477535","529472","Martina","Kaiser","","","Alvierstr. 11","9470","Buchs","CH","","","081 771 13 65","","kaiser.martina@hotmail.com","","Weiblich","15.03.1996","","Deutsch","CH","1.44.0.00.017","Grabs Sportschützen",1,0,0,1,"Aktiv-A G10m","","A","LizenzG10m","Frau","",0,1,"01.10.2010","","","",0,"1.44.0.00.017","Grabs Sportschützen","","","","Aktiv","Newsletter Email","Abonnement","27.07.2023","","Nein","Nein","","","","","",1,"01.12.2023 14:27"]
["1078015","129931","Rolf","Zollinger","","","Hauengasse 19","8215","Hallau","CH","","","052 681 40 44","079 606 50 54","r.zollinger@bluewin.ch","","Männlich","29.11.1959","","Deutsch","CH","1.44.0.00.013","Schaffhausen Sportschützen Munot",1,0,0,1,"Aktiv-A G50m","","A","LizenzG50m","Herr","",0,0,"01.07.2013","","","",0,"1.14.0.03.015","Hallau Schützen","","","","Aktiv","Newsletter Email","Abonnement","27.07.2023","","Nein","Nein","","","","","",1,"01.12.2023 14:27"]
["1061100","113015","René","Künzli","","","Steighaldenstr. 5","9602","Bazenheid","CH","","","","078 723 23 35","rene.kuenzli@thurweb.ch","","Männlich","10.03.1978","756.4235.7820.23","Deutsch","CH","1.44.0.00.022","Kirchberg Sportschützen",1,0,0,1,"Aktiv-A G50m","","A","LizenzG50m","Herr","",0,0,"01.01.1999","","","",0,"1.44.0.00.022","Kirchberg Sportschützen","","","","Aktiv","Newsletter Email","Abonnement","27.07.2023","","Nein","Nein","","","","","",1,"01.12.2023 14:27"]
["1132677","184597","Hans Peter","Schwenk","","","Chilchgasse 9","8214","Gächlingen","CH","","","","079 221 95 14","hpschwenk@solnet.ch","","Männlich","24.11.1958","756.0688.5141.50","Deutsch","CH","1.44.0.00.013","Schaffhausen Sportschützen Munot",1,0,0,1,"Aktiv-A G50m","","A","LizenzG50m","Herr","",0,0,"23.03.2022","","","",0,"1.14.0.03.059","Wilchingen / Osterfingen Schützenverein","","","","Aktiv","Newsletter Email","Abonnement","27.07.2023","","Nein","Nein","","","","","",1,"01.12.2023 14:27"]
["1173651","225576","Werner","Keller","","","Hauptstr. 23","8376","Fischingen","CH","","","071 977 13 59","079 479 36 85","cwkeller@bluewin.ch","","Männlich","08.06.1962","","Deutsch","CH","1.44.0.00.022","Kirchberg Sportschützen",1,0,0,1,"Aktiv-A G50m","","A","LizenzG50m","Herr","",0,0,"09.03.2016","","","",0,"1.20.0.06.055","Fischingen Schützengesellschaft","","","","Aktiv","Newsletter Email","Abonnement","27.07.2023","","Nein","Nein","","","","","",1,"01.12.2023 14:27"]
["1061098","113013","Roland","Graf","","","Schmiedgasse 6","3150","Schwarzenburg","CH","","","071 930 06 17","079 420 21 58","roland.graf@thurweb.ch","","Männlich","21.11.1968","756.4688.9595.39","Deutsch","CH","1.44.0.00.022","Kirchberg Sportschützen",1,0,0,1,"Aktiv-B G50m","","B","LizenzG50m","Herr","r.graf@altwerk8.ch",0,0,"01.01.1997","","","",0,"1.02.4.00.093","Schwarzenburg Sportschützen","","","","Aktiv","","","","","","","","","","","","","01.12.2023 14:27"]
["1060742","112657","Jens","Hauptmann","","","Hänisberg 3984","9602","Müselbach","CH","","","071 931 61 53","079 629 89 77","hauptmann.j@bluewin.ch","","Männlich","11.07.1960","","Deutsch","CH","1.44.0.00.022","Kirchberg Sportschützen",1,0,0,1,"Aktiv-A G50m","","A","LizenzG50m","Herr","",0,1,"10.05.2014","","","",0,"1.44.0.00.022","Kirchberg Sportschützen","","","","Aktiv","Newsletter Email","Abonnement","27.07.2023","","Nein","Nein","","","","","",1,"01.12.2023 14:27"]
["1173385","225310","Marita","Kobler","","","Wiesstr. 16","9410","Heiden","CH","","","071 891 35 12","078 776 15 15","marita.kobler@hotmail.ch","","Weiblich","21.05.1960","","Deutsch","CH","1.44.0.00.053","Wolfhalden Sportschützen",1,0,0,1,"Aktiv-A G50m","","A","LizenzG50m","Frau","",0,1,"01.03.2007","","","",0,"1.15.0.00.004","Heiden Feldschützen","","","","Aktiv","Newsletter Email","Abonnement","27.07.2023","","Nein","Nein","","","","","",1,"01.12.2023 14:27"]
["1803990","879931","Kevin","Bernet","","","Hinterdorf 3a","9533","Kirchberg SG","CH","","","","","","","Männlich","10.05.2005","","Deutsch","CH","1.44.0.00.022","Kirchberg Sportschützen",1,0,0,1,"Aktiv-A G50m","","A","LizenzG50m","Herr","",0,1,"01.01.2023","","","",0,"1.44.0.00.022","Kirchberg Sportschützen","","","","Aktiv","Newsletter Email","Abonnement","27.07.2023","","Nein","Nein","","","","","",1,"01.12.2023 14:27"]
["1061309","113224","Peter","Stacher","","","Seewies 25","8594","Güttingen","CH","","","071 695 39 42","079 370 91 75","peter.stacher@bluewin.ch","","Männlich","02.10.1973","756.6875.0467.94","Deutsch","CH","1.44.0.00.034","Schönenbaumgarten Sportschützen",1,0,0,1,"Aktiv-A G50m","","A","LizenzG50m","Herr","",0,1,"01.01.2023","","","",0,"1.20.0.05.067","Güttingen-Kesswil Schützenverein","","","","Aktiv","Newsletter Email","Abonnement","27.07.2023","","Nein","Nein","","","","","",1,"01.12.2023 14:27"]
["1277057","328987","Christoff","Rosenkranz","","","Oberdorfstr. 4","8505","Dettighofen","CH","","","052 765 35 05","079 460 10 27","crosenkranz@bluewin.ch","","Männlich","22.04.1959","756.7326.5162.31","Deutsch","CH","1.44.0.00.010","Dettighofen Sportschützen",1,0,0,1,"Aktiv-A G50m","","A","LizenzG50m","Herr","",0,0,"04.03.2009","","","",0,"1.44.0.00.010","Dettighofen Sportschützen","","","","Aktiv","Newsletter Email","Abonnement","27.07.2023","","Nein","Nein","","","","","",1,"01.12.2023 14:27"]
["1061424","113339","Fritz","Häsler","","","Kalthäusern 48","9508","Weingarten-Kalth","CH","","","052 720 18 31","079 413 04 57","","","Männlich","11.07.1940","","Deutsch","CH","1.44.0.00.046","Wängi Sportschützen",1,0,0,1,"Aktiv-A G50m","","A","LizenzG50m","Herr","",0,0,"01.01.2023","","","",0,"1.20.0.04.002","Aadorf Vereinigte Schützen","","","","Aktiv","Newsletter Email","Abonnement","27.07.2023","","Nein","Nein","","","","","",1,"01.12.2023 14:27"]
["1258168","310096","Michael","Signer","","","Kreuzlingerstr. 34","8570","Weinfelden","CH","","","","076 538 30 92","michael.signer92@bluewin.ch","","Männlich","18.07.1992","756.7514.9605.70","Deutsch","CH","1.44.0.00.010","Dettighofen Sportschützen",1,0,0,1,"Aktiv-A G50m","","A","LizenzG50m","Herr","",0,1,"11.08.2021","","","",0,"1.44.0.00.010","Dettighofen Sportschützen","","","","Aktiv","Newsletter Email","","","","","Nein","","","","","","","01.12.2023 14:27"]
["1707274","776003","Adrian","Gämperle","","22","Hofjüngerstrasse","9630","Wattwil","CH","","","","","adriangaemperle@bluewin.ch","","Männlich","11.07.1999","756.2614.7585.39","Deutsch","CH","1.44.0.00.028","Mosnang Sportschützen",1,0,0,1,"Aktiv-A G50m","","A","LizenzG50m","Herr","",0,0,"01.01.2023","","","",0,"1.44.0.00.028","Mosnang Sportschützen","","","","Aktiv","","","","","","","","","","","","","01.12.2023 14:27"]
["1226043","277970","Denise","Schwager","","","Tiefenstein  6","8354","Hofstetten ZH","CH","","","052 / 364 24 33","","","","Weiblich","13.11.1990","","Deutsch","CH","1.44.0.00.046","Wängi Sportschützen",1,0,0,1,"Aktiv-A G50m","","A","LizenzG50m","Frau","",0,0,"13.02.2004","","","",0,"1.44.0.00.046","Wängi Sportschützen","","","","Aktiv","Newsletter Email","Abonnement","27.07.2023","","Nein","Nein","","","","","",1,"01.12.2023 14:27"]
["1061190","113105","Heinrich","Bleiker","","","Neufeldstr. 1","9606","Bütschwil","CH","","","","079 697 65 25","hbleiker@thurweb.ch","","Männlich","20.03.1952","","Deutsch","CH","1.44.0.00.028","Mosnang Sportschützen",1,0,0,1,"Aktiv-A G50m","","A","LizenzG50m","Herr","hbleiker@bleiker.ch",0,0,"01.01.2023","","","",0,"1.17.0.10.059","Mosnang 300m Sport Mosnang-Mühlrüti","","","","Aktiv","Newsletter Email","Gratisabo Lieferant","27.07.2023","","Nein","Nein","","","","","",1,"01.12.2023 14:27"]
["1060960","112875","Marcel","Bürge","Bleiker Precision Engineering AG","","Püntacherstrasse 8","8487","Zell ZH","CH","","","071 930 09 61","079 469 51 24","cello-1@sunrise.ch","www.marcelbuerge.ch","Männlich","28.03.1972","","Deutsch","CH","1.44.0.00.028","Mosnang Sportschützen",1,0,0,1,"Aktiv-B G50m","","B","LizenzG50m","Herr","",0,1,"01.04.2023","","","",0,"1.17.0.01.170","Gossau SG Sportschützen","","","","Aktiv","Newsletter Email","","","","","Nein","","","","","","","01.12.2023 14:27"]
["1171951","223876","Andreas","Kuttelwascher","","","Ziegeleistr. 11","8500","Frauenfeld","CH","","","052 378 17 78","079 760 85 66","a.kuttelwascher@hotmail.ch","","Männlich","17.02.1985","756.3384.3779.75","Deutsch","CH","1.44.0.00.046","Wängi Sportschützen",1,0,0,1,"Aktiv-A G50m","","A","LizenzG50m","Herr","",0,1,"01.01.2023","","","",0,"1.44.0.00.046","Wängi Sportschützen","","","","Aktiv","Newsletter Email","","","","","Nein","","","","","","","01.12.2023 14:27"]
["1060854","112769","René","Bamert","","","Weidlistr. 51","9607","Mosnang","CH","","","071 983 00 88","079 563 08 61","r.bamert@thurweb.ch","sportschuetzen-mosnang.ch","Männlich","01.04.1972","756.9652.5294.42","Deutsch","CH","1.44.0.00.028","Mosnang Sportschützen",1,0,0,1,"Aktiv-A G50m","","A","LizenzG50m","Herr","",0,0,"01.01.1987","","","",0,"1.44.0.00.028","Mosnang Sportschützen","","","","Aktiv","Newsletter Email","Abonnement","27.07.2023","","Nein","Nein","","","","","",1,"01.12.2023 14:27"]
["1061001","112916","Arinette","Moser","","","Fürstenstr. 41","9496","Balzers","LI","","","","+423 792 33 73","arinette.hasler@gmail.com","","Weiblich","27.09.1968","","Deutsch","CH","1.44.0.00.017","Grabs Sportschützen",1,0,0,1,"Aktiv-A G10m","","A","LizenzG10m","Frau","",0,1,"01.10.2011","","","",0,"1.44.0.00.017","Grabs Sportschützen","","","","Aktiv","Newsletter Email","Abonnement","27.07.2023","18.09.2023","Nein","Nein","","","","","",1,"01.12.2023 14:27"]
["1061001","112916","Arinette","Moser","","","Fürstenstr. 41","9496","Balzers","LI","","","","+423 792 33 73","arinette.hasler@gmail.com","","Weiblich","27.09.1968","","Deutsch","CH","1.44.0.00.017","Grabs Sportschützen",1,0,0,1,"Aktiv-A G10m Auflage","","A","LizenzG10m","Frau","",0,1,"01.01.2023","","","",0,"1.44.0.00.017","Grabs Sportschützen","","","","Aktiv","Newsletter Email","Abonnement","27.07.2023","18.09.2023","Nein","Nein","","","","","",1,"01.12.2023 14:27"]
["1523794","003780","Adrian","von Allmen","","","Lindenstrasse 2","9113","Degersheim","CH","","","","","","","Männlich","14.07.2004","756.4661.3448.95","Deutsch","CH","1.44.0.00.009","Degersheim Sportschützen",1,0,0,1,"Aktiv-A G50m","","A","LizenzG50m","Herr","",0,1,"01.08.2023","","","",0,"1.44.0.00.009","Degersheim Sportschützen","","","","Aktiv","Newsletter Email","Abonnement","01.08.2023","","Nein","Nein","","","","","",1,"01.12.2023 14:27"]
["1035019","011718","Mia","Wichser","","","Oberbühl 26","9498","Planken","LI","","","","","","","Weiblich","11.11.2009","","Deutsch","CH","1.44.0.00.017","Grabs Sportschützen",1,0,0,1,"Aktiv-A G50m","","A","LizenzG50m","Frau","",0,1,"01.01.2023","","","",0,"1.44.0.00.017","Grabs Sportschützen","","","","Aktiv","Newsletter Email","Abonnement","27.07.2023","","Nein","Nein","","","","","",1,"01.12.2023 14:27"]
["1061197","113112","Sonja","Siegenthaler","","","Feldwiesstr. 2","9621","Oberhelfenschwil","CH","","","071 371 31 03","079 374 92 89","siegenthaler.sonja@bluewin.ch","","Weiblich","20.10.1980","","Deutsch","CH","1.44.0.00.009","Degersheim Sportschützen",1,0,0,1,"Aktiv-A G50m","","A","LizenzG50m","Frau","",0,0,"01.01.2023","","","",0,"1.44.0.00.009","Degersheim Sportschützen","","","","Aktiv","Newsletter Email","","","","","Nein","","","","","","","01.12.2023 14:27"]
["1344848","396780","Flurin","Kressig","","","Wiedenstr. 40","9470","Buchs","CH","","","","079 646 47 14","flurin.kressig@bluewin.ch","","Männlich","27.02.1999","756.2970.6512.84","Deutsch","CH","1.44.0.00.017","Grabs Sportschützen",1,0,0,1,"Aktiv-A G50m","","A","LizenzG50m","Herr","",0,1,"01.04.2017","","","",0,"1.17.0.05.086","Sennwald Schützenverein","","","","Aktiv","","","","","","","","","","","","","01.12.2023 14:27"]
["1835337","913149","Katrin","Boxler","","","Im Baumgarten 9","9524","Zuzwil","CH","","","","","","","Weiblich","09.12.1997","","Deutsch","CH","1.44.0.00.017","Grabs Sportschützen",1,0,0,1,"Aktiv-A G50m","","A","LizenzG50m","Frau","",0,1,"01.01.2023","","","",0,"1.44.0.00.017","Grabs Sportschützen","","","","Aktiv","Newsletter Email","Abonnement","27.07.2023","","Nein","Nein","","","","","",1,"01.12.2023 14:27"]
["1061331","113246","Walter","Hausammann","","","Schützenweg 31c","9470","Buchs SG","CH","081 785 19 40","","081 785 10 36","","w.haus@rsnweb.ch","","Männlich","30.06.1942","","Deutsch","CH","1.44.0.00.017","Grabs Sportschützen",1,0,0,1,"Aktiv-A G10m Auflage","","A","LizenzG10m","Herr","",0,1,"01.10.2019","","","",0,"1.44.0.00.017","Grabs Sportschützen","","","","Aktiv","Newsletter Email","Abonnement","27.07.2023","","Nein","Nein","","","","","",1,"01.12.2023 14:27"]
["1061331","113246","Walter","Hausammann","","","Schützenweg 31c","9470","Buchs SG","CH","081 785 19 40","","081 785 10 36","","w.haus@rsnweb.ch","","Männlich","30.06.1942","","Deutsch","CH","1.44.0.00.017","Grabs Sportschützen",0,0,0,1,"Aktiv-A G50m","","A","LizenzG50m","Herr","",0,1,"01.01.2014","","","",0,"1.44.0.00.017","Grabs Sportschützen","","","","Aktiv","Newsletter Email","Abonnement","27.07.2023","","Nein","Nein","","","31.12.2022","","",1,"01.12.2023 14:27"]
["1061139","113054","Martin","Brüllmann","","","Schlösslistr. 4","8574","Lengwil","CH","","","071 680 08 30","076 587 10 25","yasmar@bluewin.ch","","Männlich","25.10.1978","","Deutsch","CH","1.44.0.00.025","Lengwil Sportschützen",1,0,0,1,"Aktiv-A G50m","","A","LizenzG50m","Herr","",0,1,"01.01.2023","","","",0,"1.44.0.00.025","Lengwil Sportschützen","","","","Aktiv","Newsletter Email","Abonnement","27.07.2023","","Nein","Nein","","","","","",1,"01.12.2023 14:27"]
["1408025","459961","Marco","Spengler","","","Hofstrasse 5","8574","Illighausen","CH","","","","","","","Männlich","19.05.1993","756.2938.9360.95","Deutsch","CH","1.44.0.00.025","Lengwil Sportschützen",1,0,0,1,"Aktiv-A G50m","","A","LizenzG50m","Herr","",0,1,"01.01.2023","","","",0,"1.44.0.00.025","Lengwil Sportschützen","","","","Aktiv","Newsletter Email","Abonnement","27.07.2023","","Nein","Nein","","","","","",1,"01.12.2023 14:27"]
["1061150","113065","Erika","Künzler","","","Bildstr. 5","9523","Züberwangen","CH","","","","","erikakuenzler@bluewin.ch","","Weiblich","25.10.1968","","Deutsch","CH","1.44.0.00.025","Lengwil Sportschützen",1,0,0,1,"Aktiv-A G50m","","A","LizenzG50m","Frau","",0,1,"01.01.2023","","","",0,"1.44.0.00.025","Lengwil Sportschützen","","","","Aktiv","Newsletter Email","Abonnement","27.07.2023","","Nein","Nein","","","","","",1,"01.12.2023 14:27"]
["1704985","773457","Silvia","Scherrer","","","Bergli 3","9602","Bazenheid","CH","","","071 931 70 81","079 666 88 60","silviascherrer1998@gmail.com","","Weiblich","06.11.1998","","Deutsch","CH","1.44.0.00.006","Bazenheid Sportschützen",1,0,0,1,"Aktiv-A G50m","","A","LizenzG50m","Frau","",0,1,"15.03.2013","","","",0,"1.44.0.00.006","Bazenheid Sportschützen","","","","Aktiv","Newsletter Email","Abonnement","27.07.2023","","Nein","Nein","","","","","",1,"01.12.2023 14:27"]
["1670379","736427","Monja","Thalmann","","","Wilerstr. 57a","9602","Bazenheid","CH","","","071 931 43 42","076 440 09 97","monjathalmann@gmx.ch","","Weiblich","19.09.1997","","Deutsch","CH","1.44.0.00.006","Bazenheid Sportschützen",1,0,0,1,"Aktiv-A G50m","","A","LizenzG50m","Frau","",0,1,"15.03.2013","","","",0,"1.44.0.00.006","Bazenheid Sportschützen","","","","Aktiv","Newsletter Email","Abonnement","27.07.2023","","Nein","Nein","","","","","",1,"01.12.2023 14:27"]
["1061159","113074","Martin","Tschannen","","","Hauptstr. 12B","8585","Birwinken","CH","071 667 03 67","","071 688 93 60","079 293 13 68","tschannen@gmx.ch","","Männlich","25.01.1977","","Deutsch","CH","1.44.0.00.025","Lengwil Sportschützen",1,0,0,1,"Aktiv-A G50m","","A","LizenzG50m","Herr","",0,1,"01.01.2023","","","",0,"1.44.0.00.025","Lengwil Sportschützen","","","","Aktiv","Newsletter Email","Abonnement","27.07.2023","","Nein","Nein","","","","","",1,"01.12.2023 14:27"]
["1468625","520562","Diego","Wiesmann","","","Stockenweg 14c","8526","Oberneunforn","CH","","","","","diego.hamster@hotmail.com","","Männlich","26.09.1993","756.3580.6958.97","Deutsch","CH","1.44.0.00.014","Neunforn Sportschützen",1,0,0,1,"Aktiv-A G50m","","A","LizenzG50m","Herr","",0,1,"01.06.2021","","","",0,"1.20.0.04.126","Oberneunforn Feldschützengesellschaft","","","","Aktiv","","","","","","","","","","","","","01.12.2023 14:27"]
["1670380","736429","Nicolas","Hollenstein","","","Flurstrasse 3","9602","Bazenheid","CH","","","071 931 65 70","076 730 19 96","hollensteinnicolas@gmail.com","","Männlich","31.12.1996","756.9419.9101.31","Deutsch","CH","1.44.0.00.006","Bazenheid Sportschützen",1,0,0,1,"Aktiv-A G50m","","A","LizenzG50m","Herr","",0,1,"15.03.2013","","","",0,"1.44.0.00.006","Bazenheid Sportschützen","","","","Aktiv","Newsletter Email","Abonnement","27.07.2023","","Nein","Nein","","","","","",1,"01.12.2023 14:27"]
["1061500","113415","René","Fritsche","","","Schachenstr. 19","9243","Jonschwil","CH","","","071 923 72 75","079 771 98 80","redafrijon@tbwil.ch","","Männlich","23.09.1962","756.2331.7113.50","Deutsch","CH","1.44.0.00.006","Bazenheid Sportschützen",1,0,0,1,"Aktiv-A G50m","","A","LizenzG50m","Herr","",0,0,"01.01.2023","","","",0,"1.17.0.12.127","Wil SG Stadtschützen","","","","Aktiv","Newsletter Email","Abonnement","27.07.2023","","Nein","Nein","","","","","",1,"01.12.2023 14:27"]
["1216506","268433","Stephan","Hoop","","","Birkenweg 49","9498","Planken","LI","","","","","hoop_stephan@hotmail.com","","Männlich","11.10.1989","","Deutsch","LI","1.44.0.00.059","Vaduz Sportschützen",1,0,0,1,"Aktiv-A G50m","","A","LizenzG50m","Herr","",0,1,"01.01.2023","","","",0,"1.44.0.00.058","Eschen Sportschützen","","","","Aktiv","Newsletter Email","Abonnement","27.07.2023","","Nein","Nein","","","","","",1,"01.12.2023 14:27"]
["1030767","007438","Gaby","Bär","","","Hembergerstr. 50","9630","Wattwil","CH","","","","","gaby_baer@bluewin.ch","","Weiblich","27.05.1980","","Deutsch","CH","1.44.0.00.028","Mosnang Sportschützen",1,0,0,1,"Aktiv-A G50m","","A","LizenzG50m","Frau","",0,0,"01.01.2023","","","",0,"1.44.0.00.028","Mosnang Sportschützen","","","","Aktiv","Newsletter Email","Abonnement","27.07.2023","","Nein","Nein","","","","","",1,"01.12.2023 14:27"]
["1061202","113117","Josef","Mullis","","","Lindenplatz 1","9607","Mosnang","CH","071 388 72 72","","071 983 35 04","","lindenplatz@gmx.net","","Männlich","28.02.1950","756.4343.9686.47","Deutsch","CH","1.44.0.00.028","Mosnang Sportschützen",1,0,0,1,"Aktiv-A G50m","","A","LizenzG50m","Herr","",0,0,"01.01.2023","","","",0,"1.44.0.00.028","Mosnang Sportschützen","","","","Aktiv","Newsletter Email","Abonnement","27.07.2023","","Nein","Nein","","","","","",1,"01.12.2023 14:27"]
["1051286","103200","Josef","Jöhl","","","Im Juch 9","9548","Matzingen","CH","","","052 376 40 05","","","","Männlich","13.04.1936","","Deutsch","CH","1.44.0.00.046","Wängi Sportschützen",1,0,0,1,"Aktiv-A G50m","","A","LizenzG50m","Herr","",0,0,"01.04.2016","","","",0,"1.44.0.00.046","Wängi Sportschützen","","","","Aktiv","Newsletter Email","Abonnement","27.07.2023","","Nein","Nein","","","","","",1,"01.12.2023 14:27"]
["1089145","141062","Erwin","Brönnimann","","","Weiblingen 7","8577","Schönholzerswilen","CH","","","071 633 34 13","079 600 00 25","erwin-iris@bluewin.ch","","Männlich","06.03.1965","756.2999.6939.06","Deutsch","CH","1.44.0.00.046","Wängi Sportschützen",1,0,0,1,"Aktiv-A G50m","","A","LizenzG50m","Herr","",0,0,"01.06.2019","","","",0,"1.20.0.08.034","Bussnang Schützen","","","","Aktiv","","Abonnement","27.07.2023","","Nein","","","","","","",1,"01.12.2023 14:27"]
["1785444","859956","Roland","Hanselmann","","","Unterm Rain 15","9498","Planken","LI","","","","","","","Männlich","01.08.1967","","Deutsch","CH","1.44.0.00.059","Vaduz Sportschützen",1,0,0,1,"Aktiv-A G50m","","A","LizenzG50m","Herr","",0,1,"01.01.2023","","","",0,"1.44.0.00.059","Vaduz Sportschützen","","","","Aktiv","Newsletter Email","Abonnement","27.07.2023","","Nein","Nein","","","","","",1,"01.12.2023 14:27"]
["1035822","012527","Matthias","Amann","","","Wuhrstr. 7","9490","Vaduz","LI","","","","","","","Männlich","25.02.1980","","Deutsch","AT","1.44.0.00.059","Vaduz Sportschützen",1,0,0,1,"Aktiv-A G50m","","A","LizenzG50m","Herr","",0,1,"01.01.2023","","","",0,"1.44.0.00.059","Vaduz Sportschützen","","","","Aktiv","Newsletter Email","Abonnement","27.07.2023","18.09.2023","Nein","Nein","","","","","",1,"01.12.2023 14:27"]
["1061415","113330","Remo","Sele","","","Kasperigasse 2","9490","Vaduz","LI","","","+423 230 06 06","","ray@powersurf.li","","Männlich","07.06.1948","","Deutsch","LI","1.44.0.00.059","Vaduz Sportschützen",1,0,0,1,"Aktiv-A G50m","","A","LizenzG50m","Herr","",0,1,"01.04.2012","","","",0,"1.44.0.00.059","Vaduz Sportschützen","","","","Aktiv","Newsletter Email","Abonnement","27.07.2023","","Nein","Nein","","","","","",1,"01.12.2023 14:27"]
["1061625","113540","Hans","Domenig","","","Felbenweg 2","9493","Mauren FL","LI","","","+423 373 45 14","","hans.domenig@adon.li","","Männlich","08.04.1947","","Deutsch","CH","1.44.0.00.059","Vaduz Sportschützen",1,0,0,1,"Aktiv-A G50m","","A","LizenzG50m","Herr","",0,1,"01.01.2023","","","",0,"1.44.0.00.059","Vaduz Sportschützen","","","","Aktiv","","Abonnement","27.07.2023","","Nein","","","","","","",1,"01.12.2023 14:27"]
["1061331","113246","Walter","Hausammann","","","Schützenweg 31c","9470","Buchs SG","CH","081 785 19 40","","081 785 10 36","","w.haus@rsnweb.ch","","Männlich","30.06.1942","","Deutsch","CH","1.44.0.00.017","Grabs Sportschützen",1,0,0,1,"Aktiv-B G50m","","B","LizenzG50m","Herr","",0,1,"01.01.2023","","","",0,"1.44.0.00.017","Grabs Sportschützen","","","","Aktiv","Newsletter Email","Abonnement","27.07.2023","","Nein","Nein","","","","","",1,"01.12.2023 14:27"]
["1087074","138991","Jan","Kressig","","","Giessenstr. 5a","9469","Haag (Rheintal)","CH","","","081 740 02 33","079 640 35 24","kressig88@bluewin.ch","","Männlich","04.05.1988","756.4062.1705.36","Deutsch","CH","1.44.0.00.017","Grabs Sportschützen",1,0,0,1,"Aktiv-A G10m","","A","LizenzG10m","Herr","",0,1,"01.10.2009","","","",0,"1.44.0.00.017","Grabs Sportschützen","","","","Aktiv","Newsletter Email","Abonnement","27.07.2023","","Nein","Nein","","","","","",1,"01.12.2023 14:27"]
["1087074","138991","Jan","Kressig","","","Giessenstr. 5a","9469","Haag (Rheintal)","CH","","","081 740 02 33","079 640 35 24","kressig88@bluewin.ch","","Männlich","04.05.1988","756.4062.1705.36","Deutsch","CH","1.44.0.00.017","Grabs Sportschützen",1,0,0,1,"Aktiv-A G50m","","A","LizenzG50m","Herr","",0,1,"01.01.2006","","","",0,"1.44.0.00.017","Grabs Sportschützen","","","","Aktiv","Newsletter Email","Abonnement","27.07.2023","","Nein","Nein","","","","","",1,"01.12.2023 14:27"]
["1795379","870791","Nico","Fuchs","","","Stockenhofstrasse 8","9472","Grabs","CH","","","","","","","Männlich","20.09.2003","756.8477.0400.19","Deutsch","CH","1.44.0.00.017","Grabs Sportschützen",1,0,0,1,"Aktiv-A G50m","","A","LizenzG50m","Herr","",0,1,"01.04.2019","","","",0,"1.17.0.05.038","Grabs Schützenverein","","","","Aktiv","","","","","","","","","","","","","01.12.2023 14:27"]
["1257568","309496","Nadine","Bänziger","","","Sonnhaldenweg 4","9100","Herisau","CH","","","","076 675 01 25","nadine.baenziger@sunrise.ch","","Weiblich","12.07.1990","","Deutsch","CH","1.44.0.00.009","Degersheim Sportschützen",1,0,0,1,"Aktiv-A G50m","","A","LizenzG50m","Frau","",0,0,"20.03.2019","","","",0,"1.15.0.00.007","Herisau Schützenverein","","","","Aktiv","Newsletter Email","Abonnement","27.07.2023","","Nein","Nein","","","","","",1,"01.12.2023 14:27"]
["1065597","117512","Markus","Krüsi","","","Kalberweid 1120","9053","Teufen","CH","071 35 22 77","","071 330 09 66","078 731 60 34","markuskruesi@gmx.ch","","Männlich","11.09.1980","756.2494.7441.72","Deutsch","CH","1.44.0.00.009","Degersheim Sportschützen",1,0,0,1,"Aktiv-A G50m","","A","LizenzG50m","Herr","markus.kruesi@autolanter.ch",0,1,"01.04.2022","","","",0,"1.15.0.00.037","Waldstatt Schützengesellschaft","","","","Aktiv","Newsletter Email","Abonnement","27.07.2023","","Nein","Nein","","","","","",1,"01.12.2023 14:27"]
["1258977","310905","Michael","Kaiser","","","Möösli 24","9473","Gams","CH","","","","","Kaiser.Michael@hotmail.com","","Männlich","12.08.1994","756.2518.2847.07","Deutsch","CH","1.44.0.00.017","Grabs Sportschützen",1,0,0,1,"Aktiv-A G50m","","A","LizenzG50m","Herr","",0,0,"01.01.2011","","","",0,"1.44.0.00.017","Grabs Sportschützen","","","","Aktiv","Newsletter Email","Abonnement","27.07.2023","","Nein","Nein","","","","","",1,"01.12.2023 14:27"]
["1258977","310905","Michael","Kaiser","","","Möösli 24","9473","Gams","CH","","","","","Kaiser.Michael@hotmail.com","","Männlich","12.08.1994","756.2518.2847.07","Deutsch","CH","1.44.0.00.017","Grabs Sportschützen",1,0,0,1,"Aktiv-A G10m","","A","LizenzG10m","Herr","",0,0,"01.10.2011","","","",0,"1.44.0.00.017","Grabs Sportschützen","","","","Aktiv","Newsletter Email","Abonnement","27.07.2023","","Nein","Nein","","","","","",1,"01.12.2023 14:27"]
["1061022","112937","Armin","Spichtig","","","Leestr. 5","9658","Wildhaus","CH","","","","0796568441","arminspichtig@bluewin.ch","","Männlich","05.07.1961","","Deutsch","CH","1.44.0.00.017","Grabs Sportschützen",1,0,0,1,"Aktiv-A G10m Auflage","","A","LizenzG10m","Herr","",0,1,"01.11.2018","","","",0,"1.44.0.00.017","Grabs Sportschützen","","","","Aktiv","Newsletter Email","Abonnement","27.07.2023","","Nein","Nein","","","","","",1,"01.12.2023 14:27"]
["1758264","830981","Iordanis","Telidis","","","Hegastr. 63","9497","Triesenberg","LI","","","","","","","Männlich","14.07.1979","","Deutsch","LI","1.44.0.00.059","Vaduz Sportschützen",1,0,0,1,"Aktiv-A G50m","","A","LizenzG50m","Herr","",0,1,"01.04.2015","","","",0,"1.44.0.00.059","Vaduz Sportschützen","","","","Aktiv","Newsletter Email","","","","","Nein","","","","","","","01.12.2023 14:27"]
["1027641","004264","Moritz","Marxer","","","Im Loch 19","9494","Schaan","LI","","","","","","","Männlich","04.02.1991","","Deutsch","LI","1.44.0.00.059","Vaduz Sportschützen",1,0,0,1,"Aktiv-A G50m","","A","LizenzG50m","Herr","",0,0,"01.06.2021","","","",0,"1.44.0.00.059","Vaduz Sportschützen","","","","Aktiv","Newsletter Email","Abonnement","27.07.2023","18.09.2023","Nein","Nein","","","","","",1,"01.12.2023 14:27"]
["1061623","113538","Peter","Bargetze","","","Feldstr. 36","9495","Triesen","LI","","","","","","","Männlich","20.12.1962","","Deutsch","LI","1.44.0.00.059","Vaduz Sportschützen",1,0,0,1,"Aktiv-A G50m","","A","LizenzG50m","Herr","",0,1,"01.01.2023","","","",0,"1.44.0.00.059","Vaduz Sportschützen","","","","Aktiv","Newsletter Email","Abonnement","27.07.2023","","Nein","Nein","","","","","",1,"01.12.2023 14:27"]
["1026456","003065","Manfred","Zaisberger","","","Auring 2","9490","Vaduz","LI","","","","","","","Männlich","07.09.1962","","Deutsch","AT","1.44.0.00.059","Vaduz Sportschützen",1,0,0,1,"Aktiv-A G50m","","A","LizenzG50m","Herr","",0,1,"01.01.2023","","","",0,"1.44.0.00.059","Vaduz Sportschützen","","","","Aktiv","Newsletter Email","Abonnement","27.07.2023","18.09.2023","Nein","Nein","","","","","",1,"01.12.2023 14:27"]
["1801399","877196","Kay","Monz","","","Rötis 13","9492","Eschen","LI","","","","","","","Männlich","27.08.1984","","Deutsch","LI","1.44.0.00.059","Vaduz Sportschützen",1,0,0,1,"Aktiv-A G50m","","A","LizenzG50m","Herr","",0,1,"01.01.2023","","","",0,"1.44.0.00.059","Vaduz Sportschützen","","","","Aktiv","Newsletter Email","Abonnement","27.07.2023","","Nein","Nein","","","","","",1,"01.12.2023 14:27"]
["1217150","269077","Gustav","Kaufmann","","","Tanzplatz 6","9494","Schaan","LI","","","","","gustav.kaufmann@rehaloewen.ch","","Männlich","20.04.1956","","Deutsch","LI","1.44.0.00.059","Vaduz Sportschützen",1,0,0,1,"Aktiv-A G50m","","A","LizenzG50m","Herr","",0,1,"01.04.2003","","","",0,"1.44.0.00.059","Vaduz Sportschützen","","","","Aktiv","Newsletter Email","Abonnement","27.07.2023","","Nein","Nein","","","","","",1,"01.12.2023 14:27"]
["1223513","275440","Tatjana","Kolzoff","","","Landstr. 274","9495","Triesen","LI","","","","079 / 823 81 55","tatjana.kolzoff@adon.li","","Weiblich","16.08.1987","","Deutsch","LI","1.44.0.00.059","Vaduz Sportschützen",1,0,0,1,"Aktiv-A G50m","","A","LizenzG50m","Frau","",0,1,"01.01.2023","","","",0,"1.44.0.00.059","Vaduz Sportschützen","","","","Aktiv","Newsletter Email","Abonnement","27.07.2023","","Nein","Nein","","","","","",1,"01.12.2023 14:27"]
["1036832","013544","Achim","Vogt","","","Gschindstr. 33","9497","Triesenberg","LI","","","","00423 791 0370","achim.vogt@mac.com","","Männlich","07.12.1970","","Deutsch","CH","1.44.0.00.059","Vaduz Sportschützen",1,0,0,1,"Aktiv-A G50m","","A","LizenzG50m","Herr","",0,1,"01.01.2023","","","",0,"1.44.0.00.059","Vaduz Sportschützen","","","","Aktiv","Newsletter Email","Abonnement","27.07.2023","","Nein","Nein","","","","","",1,"01.12.2023 14:27"]
["1037218","013935","Michaela","Ranieri","","","Peter Kaiser Str. 40","9493","Mauren FL","LI","","","","","","","Weiblich","24.09.1984","","Deutsch","CH","1.44.0.00.059","Vaduz Sportschützen",1,0,0,1,"Aktiv-A G50m","","A","LizenzG50m","Frau","",0,1,"01.01.2023","","","",0,"1.44.0.00.059","Vaduz Sportschützen","","","","Aktiv","Newsletter Email","Abonnement","27.07.2023","","Nein","Nein","","","","","",1,"01.12.2023 14:27"]
["1051923","103837","René","Schmid","","","Im Eggli 3","8525","Niederneunforn","CH","","","052 745 18 54","079 463 65 57","rr.schmid8@bluewin.ch","","Männlich","20.06.1945","","Deutsch","CH","1.44.0.00.014","Neunforn Sportschützen",1,0,0,1,"Aktiv-A G50m","","A","LizenzG50m","Herr","",0,1,"01.01.2023","","","",0,"1.01.0.02.216","Stammheim Pistolenclub Stammertal","","","","Aktiv","Newsletter Email","Abonnement","27.07.2023","","Nein","Nein","","","","","",1,"01.12.2023 14:27"]
["1051923","103837","René","Schmid","","","Im Eggli 3","8525","Niederneunforn","CH","","","052 745 18 54","079 463 65 57","rr.schmid8@bluewin.ch","","Männlich","20.06.1945","","Deutsch","CH","1.44.0.00.014","Neunforn Sportschützen",1,0,0,1,"Aktiv-A G10m","","A","LizenzG10m","Herr","",0,1,"01.01.2023","","","",0,"1.01.0.02.216","Stammheim Pistolenclub Stammertal","","","","Aktiv","Newsletter Email","Abonnement","27.07.2023","","Nein","Nein","","","","","",1,"01.12.2023 14:27"]
["1060748","112663","Reto","Sennhauser","","","Unterdorf 1","9607","Mosnang","CH","","","","079 432 49 38","web450p1@reto-sennhauser.ch","","Männlich","21.07.1975","756.2158.6434.45","Deutsch","CH","1.44.0.00.006","Bazenheid Sportschützen",1,0,0,1,"Aktiv-A G50m","","A","LizenzG50m","Herr","",0,1,"01.01.2023","","","",0,"1.44.0.00.006","Bazenheid Sportschützen","","","","Aktiv","","","","","","","","","","","","","01.12.2023 14:27"]
["1063057","114972","Max","Keller","","","Wellhauserweg 31 A","8500","Frauenfeld","CH","","","052 721 72 65","079 605 55 16","susi.keller@sunrise.ch","","Männlich","10.09.1945","756.6505.2906.10","Deutsch","CH","1.44.0.00.014","Neunforn Sportschützen",1,0,0,1,"Aktiv-A G50m","","A","LizenzG50m","Herr","",0,0,"02.03.2017","","","",0,"1.20.0.04.062","Frauenfeld Stadtschützen Gesellschaft","","","","Aktiv","Newsletter Email","Abonnement","27.07.2023","","Nein","Nein","","","","","",1,"01.12.2023 14:27"]
["1260431","312359","Pascal","Perren","","","Zehntenstr. 7","8536","Hüttwilen","CH","","","","078 791 15 65","perren_@hotmail.com","","Männlich","30.04.1988","756.3120.1500.77","Deutsch","CH","1.44.0.00.006","Bazenheid Sportschützen",1,0,0,1,"Aktiv-A G50m","","A","LizenzG50m","Herr","",0,0,"13.03.2015","","","",0,"1.44.0.00.006","Bazenheid Sportschützen","","","","Aktiv","Newsletter Email","Abonnement","27.07.2023","","Nein","Nein","","","31.12.2023","","",1,"01.12.2023 14:27"]
["1276710","328640","Roman","Seiz","","","Birkenweg 4","8586","Andwil","CH","","","","","romanseiz@bluewin.ch","","Männlich","28.04.1992","756.4135.2747.34","Deutsch","CH","1.44.0.00.025","Lengwil Sportschützen",1,0,0,1,"Aktiv-A G50m","","A","LizenzG50m","Herr","",0,1,"01.01.2023","","","",0,"1.44.0.00.025","Lengwil Sportschützen","","","","Aktiv","Newsletter Email","Abonnement","27.07.2023","","Nein","Nein","","","","","",1,"01.12.2023 14:27"]
["1692760","760514","Christian","Meyer","","","Austr. 27","9230","Flawil","CH","","","","0791324276","chr-meyer@bluewin.ch","","Männlich","27.12.1999","756.4027.6372.96","Deutsch","CH","1.44.0.00.037","Sitterdorf Sportschützen",1,0,0,1,"Aktiv-A G50m","","A","LizenzG50m","Herr","",0,0,"02.04.2014","","","",0,"1.44.0.00.037","Sitterdorf Sportschützen","","","","Aktiv","","","","","","","","","","","","","01.12.2023 14:27"]
["1880429","960274","Zoé","Schönenberger","","","Hauptstr. 70","8588","Zihlschlacht","CH","","","","","","","Weiblich","23.03.2007","","Deutsch","CH","1.44.0.00.037","Sitterdorf Sportschützen",1,0,0,1,"Aktiv-A G50m","","A","LizenzG50m","Frau","",0,1,"04.03.2022","","","",0,"1.44.0.00.037","Sitterdorf Sportschützen","","","","Aktiv","","","","","","","","","","","","","01.12.2023 14:27"]
["1880429","960274","Zoé","Schönenberger","","","Hauptstr. 70","8588","Zihlschlacht","CH","","","","","","","Weiblich","23.03.2007","","Deutsch","CH","1.44.0.00.037","Sitterdorf Sportschützen",1,0,0,1,"Aktiv-A G10m","","A","LizenzG10m","Frau","",0,1,"01.01.2023","","","",0,"1.44.0.00.037","Sitterdorf Sportschützen","","","","Aktiv","","","","","","","","","","","","","01.12.2023 14:27"]
["1174378","226303","Richard","Probst","","","Kellenberg 471","9410","Heiden","CH","","","","079 734 34 78","richieprobst@hotmail.com","","Männlich","13.05.1985","756.2089.0286.63","Deutsch","CH","1.44.0.00.053","Wolfhalden Sportschützen",1,0,0,1,"Aktiv-A G50m","","A","LizenzG50m","Herr","",0,1,"14.03.2015","","","",0,"1.15.0.00.004","Heiden Feldschützen","","","","Aktiv","Newsletter Email","Abonnement","27.07.2023","","Nein","Nein","","","","","",1,"01.12.2023 14:27"]
["1061219","113134","Hans","Forster","","","Im Bitzi 26","9523","Züberwangen","CH","","","071 944 27 68","","","","Männlich","20.06.1956","","Deutsch","CH","1.44.0.00.022","Kirchberg Sportschützen",1,0,0,1,"Aktiv-A G50m","","A","LizenzG50m","Herr","",0,1,"28.04.2021","","","",0,"1.44.0.00.022","Kirchberg Sportschützen","","","","Aktiv","Newsletter Email","Abonnement","27.07.2023","","Nein","Nein","","","","","",1,"01.12.2023 14:27"]
["1162135","214060","Andreas","Graf","","","Paradiesstr. 32","9410","Heiden","CH","","","071 891 11 39","078 642 63 93","andreas_graf2@bluewin.ch","","Männlich","28.11.1973","","Deutsch","CH","1.44.0.00.053","Wolfhalden Sportschützen",1,0,0,1,"Aktiv-A G50m","","A","LizenzG50m","Herr","wettkaempfe@ksv-ar.ch",0,1,"19.02.2003","","","",0,"1.15.0.00.004","Heiden Feldschützen","","","","Aktiv","Newsletter Email","Abonnement","27.07.2023","","Nein","Nein","","","","","",1,"01.12.2023 14:27"]
["1719184","788942","Janis","Früh","","","Neufeldstr. 7a","9533","Kirchberg SG","CH","","","","","ursula.schoenenberger@thurweb.ch","","Männlich","13.02.2004","","Deutsch","CH","1.44.0.00.022","Kirchberg Sportschützen",1,0,0,1,"Aktiv-A G50m","","A","LizenzG50m","Herr","",0,1,"01.01.2023","","","",0,"1.44.0.00.022","Kirchberg Sportschützen","","","","Aktiv","Newsletter Email","","","","","Nein","","","","","","","01.12.2023 14:27"]
["1061302","113217","Fritz","Soltermann","","","Lengwilerstr. 22","8585","Schönenbaumgarten","CH","071 690 00 74","","071 695 12 40","079 501 03 24","fritz.soltermann@bluewin.ch","","Männlich","15.01.1961","756.2384.1769.84","Deutsch","CH","1.44.0.00.034","Schönenbaumgarten Sportschützen",1,0,0,1,"Aktiv-A G50m","","A","LizenzG50m","Herr","fritz.soltermann@bluewin.ch",0,0,"01.01.2023","","","",0,"1.44.0.00.034","Schönenbaumgarten Sportschützen","","","","Aktiv","Newsletter Email","Abonnement","27.07.2023","","Nein","Nein","","","","","",1,"01.12.2023 14:27"]
["1220297","272224","Thomas","Berger","","","Hauptstrasse 76","9553","Bettwiesen","CH","","","","079 272 25 99","t_berger@bluewin.ch","","Männlich","17.04.1992","756.7532.2975.35","Deutsch","CH","1.44.0.00.022","Kirchberg Sportschützen",1,0,0,1,"Aktiv-A G50m","","A","LizenzG50m","Herr","",0,0,"01.01.2023","","","",0,"1.20.0.06.022","Bettwiesen Schützengesellschaft","","","","Aktiv","Newsletter Email","Abonnement","27.07.2023","","Nein","Nein","","","","","",1,"01.12.2023 14:27"]
["1158069","209994","Dieter","Derrer","","","Sonnenbergstr.9","8594","Güttingen","CH","","","071 695 11 86","","dieter.derrer@icloud.com","","Männlich","08.01.1951","","Deutsch","CH","1.44.0.00.034","Schönenbaumgarten Sportschützen",1,0,0,1,"Aktiv-A G50m Auflage","","A","LizenzG50mAuflage","Herr","",0,1,"01.01.2023","","","",0,"1.20.0.05.067","Güttingen-Kesswil Schützenverein","","","","Aktiv","Newsletter Email","Abonnement","27.07.2023","","Nein","Nein","","","31.12.2023","","",1,"01.12.2023 14:27"]
["1158069","209994","Dieter","Derrer","","","Sonnenbergstr.9","8594","Güttingen","CH","","","071 695 11 86","","dieter.derrer@icloud.com","","Männlich","08.01.1951","","Deutsch","CH","1.44.0.00.034","Schönenbaumgarten Sportschützen",1,0,0,1,"Aktiv-A G50m","","A","LizenzG50m","Herr","",0,1,"01.01.2024","","","",0,"1.20.0.05.067","Güttingen-Kesswil Schützenverein","","","","Aktiv","Newsletter Email","Abonnement","27.07.2023","","Nein","Nein","","","","","",1,"01.12.2023 14:27"]
["1670588","736735","Fabian","Buff","","","Scheibe 658","9427","Wolfhalden","CH","","","","079 871 88 45","fabian-buff@bluemail.ch","","Männlich","07.04.1992","756.3958.7132.22","Deutsch","CH","1.44.0.00.053","Wolfhalden Sportschützen",1,0,0,1,"Aktiv-A G50m","","A","LizenzG50m","Herr","",0,1,"07.03.2014","","","",0,"1.44.0.00.053","Wolfhalden Sportschützen","","","","Aktiv","Newsletter Email","Abonnement","27.07.2023","","Nein","Nein","","","","","",1,"01.12.2023 14:27"]
["1060697","112612","Marco","Sonderer","","","Gaiserstr. 25","9050","Appenzell","CH","","","","078 727 89 86","marco.sonderer@elektro-sonderer.ch","","Männlich","20.07.1979","756.4816.9330.35","Deutsch","CH","1.44.0.00.050","Weissbad Sportschützen",1,0,0,1,"Aktiv-A G50m","","A","LizenzG50m","Herr","",0,1,"01.01.2023","","","",0,"1.16.0.00.003","Ried, Infanterieschützenverein Appenzell","","","","Aktiv","Newsletter Email","Abonnement","27.07.2023","","Nein","Nein","","","","","",1,"01.12.2023 14:27"]
["1226295","278222","Patrick","Zihlmann","","","Obere Hagenwilerstr. 5","8588","Zihlschlacht","CH","","","","+41 76 310 99 96","zihlmpat@bluewin.ch","","Männlich","09.04.1987","","Deutsch","CH","1.44.0.00.019","Hatswil Sportschützen",1,0,0,1,"Aktiv-A G50m","","A","LizenzG50m","Herr","",0,0,"01.01.2023","","","",0,"1.44.0.00.007","Bischofszell Sportschützen","","","","Aktiv","Newsletter Email","Abonnement","27.07.2023","","Nein","Nein","","","","","",1,"01.12.2023 14:27"]
["1802002","877814","Livio","Locher","","","Alte Enggenhüttenstrasse 2","9050","Appenzell","CH","","","","","","","Männlich","08.10.2002","756.8329.0302.05","Deutsch","CH","1.44.0.00.050","Weissbad Sportschützen",1,0,0,1,"Aktiv-A G50m","","A","LizenzG50m","Herr","",0,0,"24.04.2019","","","",0,"1.44.0.00.050","Weissbad Sportschützen","","","","Aktiv","Newsletter Email","","","","","Nein","","","","","","","01.12.2023 14:27"]
["1060780","112695","Urs","Zihlmann","","","Rümlangerstr. 14","8105","Watt","CH","","","044 840 09 62","079 771 08 45","urzi@hispeed.ch","","Männlich","17.01.1955","","Deutsch","CH","1.44.0.00.019","Hatswil Sportschützen",1,0,0,1,"Aktiv-A G50m","","A","LizenzG50m","Herr","",0,1,"05.03.2012","","","",0,"1.20.0.01.040","Hefenhofen-Dozwil Schützengesellschaft","","","","Aktiv","Newsletter Email","Abonnement","27.07.2023","","Nein","Nein","","","","","",1,"01.12.2023 14:27"]
["1061050","112965","Paul","Waelti","","","Weiherstr. 61","8580","Amriswil","CH","","","071 411 51 30","079 221 93 95","waelti.paul@bluewin.ch","","Männlich","19.11.1951","","Deutsch","CH","1.44.0.00.019","Hatswil Sportschützen",1,0,0,1,"Aktiv-A G50m","","A","LizenzG50m","Herr","",0,0,"01.01.2023","","","",0,"1.44.0.00.019","Hatswil Sportschützen","","","","Aktiv","Newsletter Email","Abonnement","27.07.2023","","Nein","Nein","","","","","",1,"01.12.2023 14:27"]
["2207672","005490","Ramon","Ambühl","","","","9050","Appenzell","CH","","","","","","","Männlich","01.01.2010","756.4824.9301.49","","CH","1.44.0.00.050","Weissbad Sportschützen",1,0,0,1,"Aktiv-A G50m","","A","LizenzG50m","Herr","",0,0,"11.09.2023","","","",0,"1.44.0.00.050","Weissbad Sportschützen","","","","Aktiv","Newsletter Email","","","","","Nein","","","","","","","01.12.2023 14:27"]
["1060681","112596","Josef","Ebneter","","","Schützenstr. 2","9320","Arbon","CH","","","","+41 79 640 87 94","josef.ebneter9@bluewin.ch","","Männlich","03.07.1960","","Deutsch","CH","1.44.0.00.050","Weissbad Sportschützen",1,0,0,1,"Aktiv-A G50m","","A","LizenzG50m","Herr","",0,0,"01.01.2023","","","",0,"1.16.0.00.021","Schwende, SV Uli Rotach-Schwende","","","","Aktiv","Newsletter Email","Abonnement","27.07.2023","","Nein","Nein","","","","","",1,"01.12.2023 14:27"]
["1061237","113152","Thomas","Locher","","","Oberer Toracker 20","9100","Herisau","CH","","","071 361 17 05","","t.locher@bluewin.ch","","Männlich","07.01.1966","756.5301.1967.06","Deutsch","CH","1.44.0.00.031","Oberegg Luftgewehrsektion",1,0,0,1,"Aktiv-A G10m","","A","LizenzG10m","Herr","",0,0,"01.01.1987","","","",0,"1.16.0.00.017","Oberegg, Feldschützen","","","","Aktiv","","Abonnement","27.07.2023","","Nein","","","","","","",1,"01.12.2023 14:27"]
["1873643","953115","Jonas","Manser","","","Rütistr. 47","9050","Appenzell","CH","","","","","andimanser@bluemail.ch","","Männlich","19.09.2006","","Deutsch","CH","1.44.0.00.050","Weissbad Sportschützen",1,0,0,1,"Aktiv-A G50m","","A","LizenzG50m","Herr","",0,1,"01.01.2023","","","",0,"1.44.0.00.050","Weissbad Sportschützen","","","","Aktiv","Newsletter Email","","","","","Nein","","","","","","","01.12.2023 14:27"]
["1060698","112613","Emil","Speck","","","Mendleweid 4","9050","Appenzell Meistersrüte","CH","","","071 787 23 29","078 611 27 97","emil.speck@bluewin.ch","","Männlich","23.05.1954","756.4988.5313.74","Deutsch","CH","1.44.0.00.002","Appenzell Luftgewehrsektion",1,0,0,1,"Aktiv-A G10m Auflage","","A","LizenzG10m","Herr","",0,0,"01.01.2023","","","",0,"1.16.0.00.006","Clanx, Schützengesellschaft Appenzell","","","","Aktiv","Newsletter Email","Abonnement","27.07.2023","","Nein","Nein","","","","","",1,"01.12.2023 14:27"]
["1088492","140409","Andreas","Wild","","","Mettlenstr. 12","9050","Appenzell","CH","","","","079 262 26 15","wild.andreas@bluewin.ch","","Männlich","17.04.1962","","Deutsch","CH","1.44.0.00.002","Appenzell Luftgewehrsektion",1,0,0,1,"Aktiv-A G10m Auflage","","A","LizenzG10m","Herr","",0,1,"01.10.2007","","","",0,"1.16.0.00.002","Eggerstanden, Schützenverein","","","","Aktiv","Newsletter Email","Abonnement","27.07.2023","","Nein","Nein","","","","","",1,"01.12.2023 14:27"]
["1088476","140393","Adolf","Wyss","","","Haldenstr. 8a","9300","Wittenbach","CH","","","071 298 12 71","079 352 45 15","doelf.wyss@bluewin.ch","","Männlich","25.01.1962","756.8767.8937.21","Deutsch","CH","1.44.0.00.002","Appenzell Luftgewehrsektion",1,0,0,1,"Aktiv-A G10m Auflage","","A","LizenzG10m","Herr","",0,0,"01.01.2023","","","",0,"1.16.0.00.021","Schwende, SV Uli Rotach-Schwende","","","","Aktiv","Newsletter Email","Abonnement","27.07.2023","","Nein","Nein","","","","","",1,"01.12.2023 14:27"]
["1060690","112605","Peter","Manser","","","Rütistr. 47","9050","Appenzell","CH","","","071 787 24 21","079 200 03 39","manser-peter@bluewin.ch","","Männlich","20.07.1952","","Deutsch","CH","1.44.0.00.002","Appenzell Luftgewehrsektion",1,0,0,1,"Aktiv-A G10m Auflage","","A","LizenzG10m","Herr","",0,1,"05.10.2016","","","",0,"1.16.0.00.002","Eggerstanden, Schützenverein","","","","Aktiv","Newsletter Email","Abonnement","27.07.2023","","Nein","Nein","","","","","",1,"01.12.2023 14:27"]
["1758221","830924","Sven","Städler","","","Gadenstatt 12","9050","Appenzell Meistersrüte","CH","","","071 787 80 11","078 858 04 55","sven.staedler131@gmail.com","","Männlich","04.12.2003","756.3792.4963.05","Deutsch","CH","1.44.0.00.002","Appenzell Luftgewehrsektion",1,0,0,1,"Aktiv-A G10m","","A","LizenzG10m","Herr","",0,0,"26.11.1900","","","",0,"1.16.0.00.006","Clanx, Schützengesellschaft Appenzell","","","","Aktiv","Newsletter Email","Abonnement","27.07.2023","","Nein","Nein","","","","","",1,"01.12.2023 14:27"]
["1910849","991812","Serina","Koster","","","Bergerstr. 7a","9057","Weissbad","CH","","","","","","","Weiblich","21.03.2008","","Deutsch","CH","1.44.0.00.002","Appenzell Luftgewehrsektion",1,0,0,1,"Aktiv-A G10m","","A","LizenzG10m","Frau","",0,0,"01.01.2023","","","",0,"1.44.0.00.002","Appenzell Luftgewehrsektion","","","","Aktiv","Newsletter Email","Abonnement","27.07.2023","","Nein","Nein","","","","","",1,"01.12.2023 14:27"]
["1060696","112611","Bernhard","Signer","","Bolisweidli","Neffenmoosstr. 10","9108","Gonten","CH","","","0717800006","079 372 93 08","bs@des.ch","","Männlich","18.03.1981","","Deutsch","CH","1.44.0.00.002","Appenzell Luftgewehrsektion",1,0,0,1,"Aktiv-A G10m","","A","LizenzG10m","Herr","",0,0,"01.01.2023","","","",0,"1.44.0.00.002","Appenzell Luftgewehrsektion","","","","Aktiv","Newsletter Email","","","","","Nein","","","","","","","01.12.2023 14:27"]
["1545433","606102","Joel","Erzinger","","","Bruggli 415","9063","Stein","CH","","","","","joel@erzinger.net","","Männlich","18.02.1995","756.9200.4370.45","Deutsch","CH","1.44.0.00.012","Egnach Sportschützen",1,0,0,1,"Aktiv-A G50m","","A","LizenzG50m","Herr","",0,1,"01.01.2012","","","",0,"1.44.0.00.012","Egnach Sportschützen","","","","Aktiv","","","","","","","","","","","","","01.12.2023 14:27"]
["1061313","113228","Hansueli","Zingg","","","Waldhof 21","8585","Langrickenbach","CH","","","071 411 67 36","","hansuelizingg@bluewin.ch","","Männlich","29.05.1955","","Deutsch","CH","1.44.0.00.034","Schönenbaumgarten Sportschützen",1,0,0,1,"Aktiv-A G50m","","A","LizenzG50m","Herr","",0,1,"01.01.2023","","","",0,"1.44.0.00.034","Schönenbaumgarten Sportschützen","","","","Aktiv","Newsletter Email","Abonnement","27.07.2023","","Nein","Nein","","","","","",1,"01.12.2023 14:27"]
["1061376","113291","Hans-Peter","Hauser","","","Pappelstr. 13","9434","Au SG","CH","","","071 744 56 94","079 507 43 20","hanspeter_hauser@bluewin.ch","www.sg-berneck.ch","Männlich","23.06.1947","","Deutsch","CH","1.44.0.00.053","Wolfhalden Sportschützen",1,0,0,1,"Aktiv-A G50m","","A","LizenzG50m","Herr","",0,1,"09.02.2011","","","",0,"1.44.0.00.053","Wolfhalden Sportschützen","","","","Aktiv","Newsletter Email","Abonnement","27.07.2023","","Nein","Nein","","","","","",1,"01.12.2023 14:27"]
["1161541","213466","Armin","Stauber","","","Bildstr. 9","8594","Güttingen","CH","","","071 695 14 44","079 455 96 28","","","Männlich","28.08.1941","","Deutsch","CH","1.44.0.00.034","Schönenbaumgarten Sportschützen",1,0,0,1,"Aktiv-A G50m","","A","LizenzG50m","Herr","",0,1,"01.01.2014","","","",0,"1.20.0.05.067","Güttingen-Kesswil Schützenverein","","","","Aktiv","","Abonnement","27.07.2023","","Nein","","","","","","",1,"01.12.2023 14:27"]
["1761919","834968","Yari","Wiederkehr","","","Müliwisweg 4","9602","Bazenheid","CH","","","","0775298402","yari@thurweb.ch","","Männlich","06.11.2006","756.9139.8816.98","Deutsch","CH","1.44.0.00.022","Kirchberg Sportschützen",1,0,0,1,"Aktiv-A G50m","","A","LizenzG50m","Herr","",0,1,"01.01.2023","","","",0,"1.44.0.00.022","Kirchberg Sportschützen","","","","Aktiv","","","","","","","","","","","","","01.12.2023 14:27"]
["1061305","113220","Wädi","Spengler","","","Unterdorfstr. 9","8585","Zuben","CH","","","071 695 14 47","079 406 95 93","info@festlatschi.ch","","Männlich","20.02.1962","","Deutsch","CH","1.44.0.00.034","Schönenbaumgarten Sportschützen",1,0,0,1,"Aktiv-A G50m","","A","LizenzG50m","Herr","",0,1,"01.01.2023","","","",0,"1.44.0.00.034","Schönenbaumgarten Sportschützen","","","","Aktiv","Newsletter Email","","","","","Nein","","","","","","","01.12.2023 14:27"]
["1061542","113457","Ralph","Künzler","","","Obstgartenweg 7","9442","Berneck","CH","071 727 61 76","","","0795062765","ralph_kuenzler@bluewin.ch","","Männlich","16.08.1982","756.6403.4506.28","Deutsch","CH","1.44.0.00.053","Wolfhalden Sportschützen",1,0,0,1,"Aktiv-A G50m","","A","LizenzG50m","Herr","",0,0,"01.01.1999","","","",0,"1.44.0.00.053","Wolfhalden Sportschützen","","","","Aktiv","Newsletter Email","Abonnement","27.07.2023","","Nein","Nein","","","","","",1,"01.12.2023 14:27"]
["1080731","132647","Erich","Hagmann","","","Michelau 25","9615","Dietfurt","CH","","","071 983 56 30","079 331 48 05","e.hagmann@tbwil.ch","","Männlich","27.04.1953","756.7091.7716.99","Deutsch","CH","1.44.0.00.022","Kirchberg Sportschützen",1,0,0,1,"Aktiv-A G50m","","A","LizenzG50m","Herr","",0,1,"15.06.2011","","","",0,"1.17.0.12.074","Oberrindal Militärschützenverein","","","","Aktiv","Newsletter Email","Abonnement","27.07.2023","","Nein","Nein","","","","","",1,"01.12.2023 14:27"]
["1719183","788941","Livia","Schnelli","","","Trubeweg 1","9533","Dietschwil","CH","","","","","","","Weiblich","04.12.2004","","Deutsch","CH","1.44.0.00.022","Kirchberg Sportschützen",1,0,0,1,"Aktiv-A G50m","","A","LizenzG50m","Frau","",0,1,"01.01.2023","","","",0,"1.44.0.00.022","Kirchberg Sportschützen","","","","Aktiv","Newsletter Email","","","","","Nein","","","","","","","01.12.2023 14:27"]
["1240045","291972","David","Klaus","","","Oberdorfstrasse 13a","9512","Rossrüti","CH","","","","079 242 01 82","davidklaus@hotmail.com","","Männlich","26.03.1992","756.7014.1436.26","Deutsch","CH","1.44.0.00.022","Kirchberg Sportschützen",1,0,0,1,"Aktiv-A G50m","","A","LizenzG50m","Herr","",0,0,"01.01.2023","","","",0,"1.44.0.00.022","Kirchberg Sportschützen","","","","Aktiv","Newsletter Email","Abonnement","27.07.2023","","Nein","Nein","","","","","",1,"01.12.2023 14:27"]
["1061022","112937","Armin","Spichtig","","","Leestr. 5","9658","Wildhaus","CH","","","","0796568441","arminspichtig@bluewin.ch","","Männlich","05.07.1961","","Deutsch","CH","1.44.0.00.017","Grabs Sportschützen",1,0,0,1,"Aktiv-B G50m","","B","LizenzG50m","Herr","",0,1,"01.01.2023","","","",0,"1.44.0.00.017","Grabs Sportschützen","","","","Aktiv","Newsletter Email","Abonnement","27.07.2023","","Nein","Nein","","","","","",1,"01.12.2023 14:27"]
["2200483","003784","Florian","Kolp","","","Gossauerstrasse 129","9100","Herisau","CH","","","","","","","Männlich","01.12.2006","","","CH","1.44.0.00.009","Degersheim Sportschützen",1,0,0,1,"Aktiv-A G50m","","A","LizenzG50m","Herr","",0,0,"01.08.2023","","","",0,"1.44.0.00.009","Degersheim Sportschützen","","","","Aktiv","Newsletter Email","Abonnement","01.08.2023","","Nein","Nein","","","","","",1,"01.12.2023 14:27"]
["1061018","112933","Alfred","Sonderegger","","","Staudnerbergstr. 1","9472","Grabs","CH","","","081 771 43 69","079 266 21 79","alfred.sonderegger@bluewin.ch","","Männlich","21.04.1954","","Deutsch","CH","1.44.0.00.017","Grabs Sportschützen",1,0,0,1,"Aktiv-A G50m","","A","LizenzG50m","Herr","",0,1,"01.01.2023","","","",0,"1.44.0.00.017","Grabs Sportschützen","","","","Aktiv","Newsletter Email","Abonnement","27.07.2023","","Nein","Nein","","","","","",1,"01.12.2023 14:27"]
["1061018","112933","Alfred","Sonderegger","","","Staudnerbergstr. 1","9472","Grabs","CH","","","081 771 43 69","079 266 21 79","alfred.sonderegger@bluewin.ch","","Männlich","21.04.1954","","Deutsch","CH","1.44.0.00.017","Grabs Sportschützen",1,0,0,1,"Aktiv-A G10m Auflage","","A","LizenzG10m","Herr","",0,1,"01.10.2019","","","",0,"1.44.0.00.017","Grabs Sportschützen","","","","Aktiv","Newsletter Email","Abonnement","27.07.2023","","Nein","Nein","","","","","",1,"01.12.2023 14:27"]
["1280232","332163","Sandra","Bänziger","","","Gibelhalde 32 d","9100","Herisau","CH","","","071 352 26 47","076 596 82 30","sandra.baenziger@sunrise.ch","","Weiblich","13.01.1992","","Deutsch","CH","1.44.0.00.009","Degersheim Sportschützen",1,0,0,1,"Aktiv-A G50m","","A","LizenzG50m","Frau","",0,0,"20.03.2019","","","",0,"1.44.0.00.009","Degersheim Sportschützen","","","","Aktiv","Newsletter Email","","","","","Nein","","","","","","","01.12.2023 14:27"]
["1617373","679809","Amalia","Flepp","","","St. Luzistr. 49","9492","Eschen","LI","","","","","","","Weiblich","17.02.1959","","Deutsch","CH","1.44.0.00.058","Eschen Sportschützen",1,0,0,1,"Aktiv-A G10m Auflage","","A","LizenzG10m","Frau","",0,1,"01.01.2023","","","",0,"1.44.0.00.058","Eschen Sportschützen","","","","Aktiv","Newsletter Email","Abonnement","27.07.2023","","Nein","Nein","","","","","",1,"01.12.2023 14:27"]
["1699307","767500","Larissa","Vanoni","","","Palduinstr. 26","9496","Balzers","LI","","","","","larissa@vanoni.li","","Weiblich","03.08.1999","","Deutsch","LI","1.44.0.00.045","Vaduz Zimmerschützen",1,0,0,1,"Aktiv-A G10m","","A","LizenzG10m","Frau","",0,1,"01.01.2023","","","",0,"1.44.0.00.045","Vaduz Zimmerschützen","","","","Aktiv","Newsletter Email","","","","","Nein","","","","","","","01.12.2023 14:27"]
["1222355","274282","Matthias","Willi","","","Zeughaustr. 26","8887","Mels","CH","","","","078 906 28 48","matthias.willi@willi-immobilien.ch","","Männlich","26.07.1992","756.1978.9402.53","Deutsch","CH","1.44.0.00.027","Mels Kleinkaliberschützen",1,0,0,1,"Aktiv-A G50m","","A","LizenzG50m","Herr","",0,0,"13.03.2011","","","",0,"1.17.0.06.052","Mels Schützenverein","","","","Aktiv","Newsletter Email","Abonnement","27.07.2023","","Nein","Nein","","","","","",1,"01.12.2023 14:27"]
["1061263","113178","Marco","Hobi","","","Gargellen / Fontanixerstr. 64","8887","Mels","CH","","","081 710 65 35","079 257 39 39","hochwart126@bluewin.ch","","Männlich","16.06.1968","756.7603.7748.35","Deutsch","CH","1.44.0.00.027","Mels Kleinkaliberschützen",1,0,0,1,"Aktiv-A G50m","","A","LizenzG50m","Herr","",0,1,"09.03.2018","","","",0,"1.17.0.06.052","Mels Schützenverein","","","","Aktiv","Newsletter Email","Abonnement","27.07.2023","","Nein","Nein","","","","","",1,"01.12.2023 14:27"]
["1099667","151585","Urs","Beck","","","Im Pfatt 1","9216","Hohentannen","CH","","","071 422 46 11","","ursbeck@icloud.com","","Männlich","14.01.1958","","Deutsch","CH","1.44.0.00.037","Sitterdorf Sportschützen",1,0,0,1,"Aktiv-A G50m","","A","LizenzG50m","Herr","",0,1,"27.03.2010","","","",0,"1.20.0.01.078","Hohentannen-Heldswil Feldschützenverein","","","","Aktiv","Newsletter Email","Abonnement","27.07.2023","","Nein","Nein","","","","","",1,"01.12.2023 14:27"]
["1244107","296034","Martina","Scherrer","","","Schneitstr. 6","9650","Nesslau","CH","","","","","","","Weiblich","21.05.1994","","Deutsch","CH","1.44.0.00.055","Dicken Ebnat-Kappel Sportschützen",1,0,0,1,"Aktiv-A G50m","","A","LizenzG50m","Frau","",0,0,"01.01.2023","","","",0,"1.44.0.00.011","Ebnat-Kappel & Umgebung Luftgewehrsektion","","","","Aktiv","Newsletter Email","Abonnement","27.07.2023","","Nein","Nein","","","","","",1,"01.12.2023 14:27"]
["1276037","327967","Diego","Beck","","","Hauptstr. 6","9216","Hohentannen","CH","","","071 422 49 43","079 575 05 96","diegogobeck@gmail.com","","Männlich","30.05.1994","756.1028.5583.77","Deutsch","CH","1.44.0.00.037","Sitterdorf Sportschützen",1,0,0,1,"Aktiv-A G50m","","A","LizenzG50m","Herr","",0,0,"01.01.2023","","","",0,"1.44.0.00.037","Sitterdorf Sportschützen","","","","Aktiv","Newsletter Email","Abonnement","27.07.2023","","Nein","Nein","","","","","",1,"01.12.2023 14:27"]
["1060878","112793","Hansueli","Mettler","","","Gerbeweg 15","9630","Wattwil","CH","","","071 988 57 37","","humettler@bluewin.ch","","Männlich","12.12.1965","756.7892.3653.70","Deutsch","CH","1.44.0.00.055","Dicken Ebnat-Kappel Sportschützen",1,0,0,1,"Aktiv-A G50m","","A","LizenzG50m","Herr","",0,0,"01.01.2023","","","",0,"1.44.0.00.055","Dicken Ebnat-Kappel Sportschützen","","","","Aktiv","Newsletter Email","Abonnement","27.07.2023","","Nein","Nein","","","","","",1,"01.12.2023 14:27"]
["1117640","169559","Markus","Krucker","","","Waldparkstr. 3","9220","Bischofszell","CH","071 424 97 66","","071 422 54 47","079 838 90 47","krucker66@gmail.com","","Männlich","18.03.1966","756.0773.8760.02","Deutsch","CH","1.44.0.00.037","Sitterdorf Sportschützen",1,0,0,1,"Aktiv-A G50m","","A","LizenzG50m","Herr","markus.krucker@bina.ch",0,1,"01.06.2008","","","",0,"1.20.0.01.026","Bischofszell Stadtschützen","","","","Aktiv","Newsletter Email","Abonnement","27.07.2023","","Nein","Nein","","","","","",1,"01.12.2023 14:27"]
["1061576","113491","Ernst","Wymann","","","Ebnaterstr. 39","9642","Ebnat-Kappel","CH","","","","","","","Männlich","08.12.1945","","Deutsch","CH","1.44.0.00.055","Dicken Ebnat-Kappel Sportschützen",1,0,0,1,"Aktiv-A G50m","","A","LizenzG50m","Herr","",0,1,"01.01.2023","","","",0,"1.44.0.00.055","Dicken Ebnat-Kappel Sportschützen","","","","Aktiv","Newsletter Email","Abonnement","27.07.2023","","Nein","Nein","","","","","",1,"01.12.2023 14:27"]
["1061144","113059","Marco","Gerardi","","","Dettighoferstr. 2","8574","Lengwil","CH","","","071 688 29 25","076 514 66 33","sirputry@gmx.ch","","Männlich","17.08.1984","","Deutsch","CH","1.44.0.00.025","Lengwil Sportschützen",1,0,0,1,"Aktiv-A G50m","","A","LizenzG50m","Herr","",0,1,"01.01.2023","","","",0,"1.44.0.00.025","Lengwil Sportschützen","","","","Aktiv","Newsletter Email","Abonnement","27.07.2023","","Nein","Nein","","","","","",1,"01.12.2023 14:27"]
["1060856","112771","Daniel","Brägger","","","Schönengrundstr. 18","9104","Waldstatt","CH","","","071 994 23 29","078 893 26 52","braeggerdani@bluewin.ch","","Männlich","28.03.1972","756.0494.4254.97","Deutsch","CH","1.44.0.00.055","Dicken Ebnat-Kappel Sportschützen",1,0,0,1,"Aktiv-A G50m","","A","LizenzG50m","Herr","",0,0,"01.01.2023","","","",0,"1.17.0.09.057","Nesslau Schützengesellschaft","","","","Aktiv","Newsletter Email","Abonnement","27.07.2023","","Nein","Nein","","","","","",1,"01.12.2023 14:27"]
["1094005","145922","Heiri","Tschumper","","","Büel 517","9630","Wattwil","CH","","","071 988 59 28","","","","Männlich","04.02.1981","","Deutsch","CH","1.44.0.00.055","Dicken Ebnat-Kappel Sportschützen",1,0,0,1,"Aktiv-A G50m","","A","LizenzG50m","Herr","",0,0,"27.03.2012","","","",0,"1.44.0.00.011","Ebnat-Kappel & Umgebung Luftgewehrsektion","","","","Aktiv","Newsletter Email","Abonnement","27.07.2023","","Nein","Nein","","","","","",1,"01.12.2023 14:27"]
["1491494","543774","Yaron","Wolfson","","","Im Stoffel 41","8887","Mels","CH","","","081 723 36 13","079 859 37 26","yaron.wolfson@kks-mels.ch","","Männlich","28.08.1996","756.7072.2758.02","Deutsch","CH","1.44.0.00.027","Mels Kleinkaliberschützen",1,0,0,1,"Aktiv-A G50m","","A","LizenzG50m","Herr","",0,0,"04.03.2016","","","",0,"1.44.0.00.027","Mels Kleinkaliberschützen","","","","Aktiv","Newsletter Email","","","","","Nein","","","","","","","01.12.2023 14:27"]
["1260180","312108","Manuel","Kurath","","","Mädriserstrasse 9","8887","Mels","CH","","","081 723 62 45","079 404 17 31","manuel.kurath@kks-mels.ch","","Männlich","08.05.1989","756.6665.4396.76","Deutsch","CH","1.44.0.00.027","Mels Kleinkaliberschützen",1,0,0,1,"Aktiv-A G50m","","A","LizenzG50m","Herr","",0,1,"13.03.2009","","","",0,"1.44.0.00.027","Mels Kleinkaliberschützen","","","","Aktiv","","Abonnement","27.07.2023","","Nein","","","","","","",1,"01.12.2023 14:27"]
["1800368","876121","Jan","Good","","","Schmelziweg","8889","Plons","CH","","","","","jan.good@kks-mels.ch","","Männlich","17.12.2004","756.9441.2846.44","Deutsch","CH","1.44.0.00.027","Mels Kleinkaliberschützen",1,0,0,1,"Aktiv-A G50m","","A","LizenzG50m","Herr","",0,0,"02.05.2023","","","",0,"1.44.0.00.027","Mels Kleinkaliberschützen","","","","Aktiv","","Abonnement","02.05.2023","","Nein","","","","","","",1,"01.12.2023 14:27"]
["1257035","308963","Sandro","Greuter","","","Im Stoffel 15","8887","Mels","CH","","","081 723 61 90","079 641 65 35","sandro.greuter@hotmail.com","","Männlich","25.02.1993","756.5248.7430.18","Deutsch","CH","1.44.0.00.027","Mels Kleinkaliberschützen",0,0,0,1,"Aktiv-B G50m","","B","LizenzG50m","Herr","",0,0,"08.03.2019","","","",0,"1.44.0.00.033","Sargans Sportschützen","","","","Aktiv","","Abonnement","27.07.2023","","Nein","","","","10.09.2020","","",1,"01.12.2023 14:27"]
["1743336","814740","Damian","Vetsch","","","Underfelsbach 16","9473","Gams","CH","","","","","","","Männlich","30.07.2003","756.5982.0577.47","Deutsch","CH","1.44.0.00.017","Grabs Sportschützen",1,0,0,1,"Aktiv-A G10m","","A","LizenzG10m","Herr","",0,0,"01.10.2021","","","",0,"1.44.0.00.017","Grabs Sportschützen","","","","Aktiv","Newsletter Email","","","","","Nein","","","","","","","01.12.2023 14:27"]
["1061172","113087","Thomas","Ackermann","","","Grossfeldstr. 6b","8887","Mels","CH","","","081 723 62 13","","","","Männlich","06.01.1986","756.5001.0819.82","Deutsch","CH","1.44.0.00.027","Mels Kleinkaliberschützen",0,0,0,1,"Aktiv-A G50m","","A","LizenzG50m","Herr","",0,0,"19.03.2015","","","",0,"1.44.0.00.027","Mels Kleinkaliberschützen","","","","Aktiv","","","","","","","","","26.02.2016","","","","01.12.2023 14:27"]
["2196282","002140","Noah","Eberle ","","","Glashüttenweg 11","8887","Mels","CH","","","","","noah.eberle@kks-mels.ch","","Männlich","03.12.2009","","","CH","1.44.0.00.027","Mels Kleinkaliberschützen",1,0,0,1,"Aktiv-A G50m","","A","LizenzG50m","","",0,0,"02.05.2023","","","",0,"1.44.0.00.027","Mels Kleinkaliberschützen","","","","Aktiv","Newsletter Email","Abonnement","02.05.2023","","Nein","Nein","","","","","",1,"01.12.2023 14:27"]
["2196283","002153","Sergej","Lakobrija","","","Fabrikstrasse 26","8887","Mels","CH","","","","","sergej.lakobrija@kks-mels.ch","","Männlich","09.04.2010","","Deutsch","RS","1.44.0.00.027","Mels Kleinkaliberschützen",0,0,0,1,"Aktiv-A G50m","","A","LizenzG50m","","",0,0,"02.05.2023","","","",0,"1.44.0.00.027","Mels Kleinkaliberschützen","","","","Aktiv","Newsletter Email","Abonnement","02.05.2023","02.05.2023","Nein","Nein","","","02.05.2023","","",1,"01.12.2023 14:27"]
["1736582","807741","Johannes","Egger","","","Finne 25","9496","Balzers","LI","","","","","","","Männlich","22.04.1971","","Deutsch","AT","1.44.0.00.045","Vaduz Zimmerschützen",1,0,0,1,"Aktiv-A G10m","","A","LizenzG10m","Herr","",0,1,"01.01.2023","","","",0,"1.44.0.00.045","Vaduz Zimmerschützen","","","","Aktiv","Newsletter Email","Abonnement","27.07.2023","","Nein","Nein","","","","","",1,"01.12.2023 14:27"]
["1063555","115470","Walter","Kast","","","Neugasse 3a","9442","Berneck","CH","","","071 744 45 74","","w.kast@bluewin.ch","","Männlich","21.06.1962","","Deutsch","CH","1.44.0.00.053","Wolfhalden Sportschützen",1,0,0,1,"Aktiv-A G50m","","A","LizenzG50m","Herr","",0,1,"31.03.2008","","","",0,"1.17.0.04.013","Berneck Schützengesellschaft","","","","Aktiv","Newsletter Email","Abonnement","27.07.2023","","Nein","Nein","","","","","",1,"01.12.2023 14:27"]
["1060664","112579","Serge","Looser","","","Nebengrabenstr. 27","9430","St. Margrethen SG","CH","","","071 744 05 78","079 299 59 17","sdlooser@bluemail.ch","","Männlich","12.12.1979","756.8604.3233.05","Deutsch","CH","1.44.0.00.053","Wolfhalden Sportschützen",1,0,0,1,"Aktiv-A G50m","","A","LizenzG50m","Herr","",0,1,"14.03.2015","","","",0,"1.15.0.00.004","Heiden Feldschützen","","","","Aktiv","Newsletter Email","","","","","Nein","","","","","","","01.12.2023 14:27"]
["1061287","113202","Elisabeth","Hemminger","","","Rutishausen 8","8585","Langrickenbach","CH","","","071 411 60 20","","elisabeth.hemminger@bluewin.ch","","Weiblich","03.10.1947","","Deutsch","CH","1.44.0.00.034","Schönenbaumgarten Sportschützen",1,0,0,1,"Aktiv-A G50m","","A","LizenzG50m","Frau","",0,1,"01.01.2023","","","",0,"1.44.0.00.034","Schönenbaumgarten Sportschützen","","","","Aktiv","Newsletter Email","Abonnement","27.07.2023","","Nein","Nein","","","","","",1,"01.12.2023 14:27"]
["1061535","113450","Elmar","Alder","","","Aeschi 509","9428","Walzenhausen","CH","","","071 888 30 58","079 771 99 70","alder-elmar@bluewin.ch","","Männlich","13.10.1956","","Deutsch","CH","1.44.0.00.053","Wolfhalden Sportschützen",1,0,0,1,"Aktiv-A G50m","","A","LizenzG50m","Herr","",0,1,"01.01.1974","","","",0,"1.44.0.00.053","Wolfhalden Sportschützen","","","","Aktiv","Newsletter Email","Abonnement","27.07.2023","","Nein","Nein","","","","","",1,"01.12.2023 14:27"]
["1094468","146385","Lukas","Walser","","","Torfneststr. 5","9413","Oberegg","CH","","","0715701656","0787350577","lukas@walser.ai","","Männlich","25.02.1989","756.2326.5285.74","Deutsch","CH","1.44.0.00.053","Wolfhalden Sportschützen",1,0,0,1,"Aktiv-A G50m","","A","LizenzG50m","Herr","",0,0,"01.01.2014","","","",0,"1.16.0.00.017","Oberegg, Feldschützen","","","","Aktiv","Newsletter Email","Abonnement","27.07.2023","","Nein","Nein","","","","","",1,"01.12.2023 14:27"]
["1061540","113455","Carl","Kamber","","","Toniwisweg 6","9443","Widnau","CH","","","071 722 92 63","079 423 33 06","kambercarl@bluewin.ch","","Männlich","16.01.1956","","Deutsch","CH","1.44.0.00.053","Wolfhalden Sportschützen",1,0,0,1,"Aktiv-A G50m","","A","LizenzG50m","Herr","",0,1,"01.01.1976","","","",0,"1.44.0.00.053","Wolfhalden Sportschützen","","","","Aktiv","Newsletter Email","Abonnement","27.07.2023","","Nein","Nein","","","","","",1,"01.12.2023 14:27"]
["1873381","952827","Müriel","Wernli","","","Leuchen 427","9428","Walzenhausen","CH","","","","","muriel.wernli@gmail.com","","Weiblich","13.01.1957","","Deutsch","CH","1.44.0.00.053","Wolfhalden Sportschützen",1,0,0,1,"Aktiv-A G50m Auflage","","A","LizenzG50mAuflage","Frau","",0,0,"01.03.2021","","","",0,"1.17.0.04.058","Montlingen Feldschützengesellschaft","","","","Aktiv","Newsletter Email","","","","","Nein","","","","","","","01.12.2023 14:27"]
["1698043","766199","Mario","Schlau","","","Ausserdorfstr. 11b","9524","Zuzwil","CH","","","","078 600 83 91","m-schlau@gmx.ch","","Männlich","21.03.1989","","Deutsch","DE","1.44.0.00.022","Kirchberg Sportschützen",1,0,0,1,"Aktiv-A G50m","","A","LizenzG50m","Herr","",0,1,"01.01.2023","","","",0,"1.44.0.00.022","Kirchberg Sportschützen","","","","Aktiv","Newsletter Email","Abonnement","27.07.2023","","Nein","Nein","","","","","",1,"01.12.2023 14:27"]
["1803992","879933","Stephanie","Scherrer","","","unt. Harfenbergstr. 5","9533","Kirchberg SG","CH","","","","","","","Weiblich","20.07.2004","","Deutsch","CH","1.44.0.00.022","Kirchberg Sportschützen",1,0,0,1,"Aktiv-A G50m","","A","LizenzG50m","Frau","",0,1,"01.01.2023","","","",0,"1.44.0.00.022","Kirchberg Sportschützen","","","","Aktiv","Newsletter Email","Abonnement","27.07.2023","","Nein","Nein","","","","","",1,"01.12.2023 14:27"]
["2207669","005488","Tobias","Fässler","","","","9050","Appenzell","CH","","","","","","","Männlich","25.01.2012","756.8788.5065.94","","CH","1.44.0.00.050","Weissbad Sportschützen",1,0,0,1,"Aktiv-A G50m","","A","LizenzG50m","Herr","",0,0,"11.09.2023","","","",0,"1.44.0.00.050","Weissbad Sportschützen","","","","Aktiv","Newsletter Email","","","","","Nein","","","","","","","01.12.2023 14:27"]
["1061245","113160","Viktor","Sonderegger","","","Schlossbachstr. 13","9404","Rorschacherberg","CH","","","071 855 42 74","+41 79 517 39 88","v.sonderegger@bluewin.ch","","Männlich","29.05.1962","756.6836.6889.02","Deutsch","CH","1.44.0.00.031","Oberegg Luftgewehrsektion",1,0,0,1,"Aktiv-A G10m","","A","LizenzG10m","Herr","",0,0,"01.01.1987","","","",0,"1.16.0.00.017","Oberegg, Feldschützen","","","","Aktiv","Newsletter Email","Abonnement","27.07.2023","","Nein","Nein","","","","","",1,"01.12.2023 14:27"]
["1901203","981907","Vincenza","Zumstein","","","St. Antonstr. 5","9050","Appenzell","CH","","","+41 79 127 40 03","","vincenza.zumstein@bluewin.ch","","Weiblich","09.08.2005","756.5314.5829.61","Deutsch","CH","1.44.0.00.050","Weissbad Sportschützen",1,0,0,1,"Aktiv-A G50m","","A","LizenzG50m","Frau","",0,0,"29.04.2022","","","",0,"1.44.0.00.050","Weissbad Sportschützen","","","","Aktiv","","","","","","","","","","","","","01.12.2023 14:27"]
["1056243","108158","Roman","Frei","","","Romanshornerstr. 28","8592","Uttwil","CH","","","0714636287","0795066168","freiroman@bluewin.ch","","Männlich","28.09.1961","756.6932.3539.64","Deutsch","CH","1.44.0.00.019","Hatswil Sportschützen",1,0,0,1,"Aktiv-A G50m","","A","LizenzG50m","Herr","",0,1,"01.01.2002","","","",0,"1.44.0.00.007","Bischofszell Sportschützen","","","","Aktiv","Newsletter Email","Abonnement","27.07.2023","","Nein","Nein","","","","","",1,"01.12.2023 14:27"]
["1273737","325667","Larissa","Bösch","","","Ilgenstr. 10","8854","Siebnen","CH","","","","079 921 68 32","larissa.boesch@gmx.ch","","Weiblich","19.08.1996","","Deutsch","CH","1.44.0.00.011","Ebnat-Kappel & Umgebung Luftgewehrsektion",1,0,0,1,"Aktiv-A G10m","","A","LizenzG10m","Frau","",0,1,"01.01.2023","","","",0,"1.44.0.00.011","Ebnat-Kappel & Umgebung Luftgewehrsektion","","","","Aktiv","Newsletter Email","Abonnement","27.07.2023","","Nein","Nein","","","","","",1,"01.12.2023 14:27"]
["1869965","949288","Janin","Gmünder","","","Möserwies 21","9050","Appenzell Eggerst.","CH","","","","","","","Weiblich","07.01.2005","","Deutsch","CH","1.44.0.00.050","Weissbad Sportschützen",1,0,0,1,"Aktiv-A G50m","","A","LizenzG50m","Frau","",0,1,"28.05.2019","","","",0,"1.44.0.00.050","Weissbad Sportschützen","","","","Aktiv","Newsletter Email","","","","","Nein","","","","","","","01.12.2023 14:27"]
["1174615","226540","Fredy","Villiger","","","Wetzikerstr. 44","8335","Hittnau","CH","","","","078 690 75 99","fredyvilliger@bluewin.ch","","Männlich","06.06.1964","756.8402.7959.84","Deutsch","CH","1.44.0.00.019","Hatswil Sportschützen",1,0,0,1,"Aktiv-A G50m","","A","LizenzG50m","Herr","",0,0,"05.03.2023","","","",0,"1.01.0.08.066","Hittnau Schützengesellschaft","","","","Aktiv","","","","","","","","","","","","","01.12.2023 14:27"]
["1060669","112584","Patrick","Sprenger","","","Kriessernstr. 6B","9462","Montlingen","CH","","","071 761 00 67","079 331 37 93","p-sprenger@bluewin.ch","","Männlich","22.10.1976","756.8468.4373.85","Deutsch","CH","1.44.0.00.050","Weissbad Sportschützen",0,0,0,1,"Aktiv-B G50m","","B","LizenzG50m","Herr","",0,0,"11.09.2019","","","",0,"1.44.0.00.001","Altstätten Sportschützen","","","","Aktiv","Newsletter Email","Abonnement","27.07.2023","31.12.2023","Nein","Nein","","","31.12.2022","","",1,"01.12.2023 14:27"]
["1650547","715215","Simon","Gmünder","","","Möserwies 21","9050","Eggerstanden","CH","","","","","monika.gmuender@hispeed.ch","","Männlich","08.05.2003","","Deutsch","CH","1.44.0.00.050","Weissbad Sportschützen",1,0,0,1,"Aktiv-A G50m","","A","LizenzG50m","Herr","",0,1,"01.04.2023","","","",0,"1.44.0.00.050","Weissbad Sportschützen","","","","Aktiv","","","","","","","","","","","","","01.12.2023 14:27"]
["1035822","012527","Matthias","Amann","","","Wuhrstr. 7","9490","Vaduz","LI","","","","","","","Männlich","25.02.1980","","Deutsch","AT","1.44.0.00.045","Vaduz Zimmerschützen",1,0,0,1,"Aktiv-A G10m","","A","LizenzG10m","Herr","",0,1,"01.01.2023","","","",0,"1.44.0.00.059","Vaduz Sportschützen","","","","Aktiv","Newsletter Email","Abonnement","27.07.2023","18.09.2023","Nein","Nein","","","","","",1,"01.12.2023 14:27"]
["1041559","018311","Lars","Kaufmann","","","Gatter 16","9496","Balzers","LI","","","","","","","Männlich","07.05.2007","","Deutsch","LI","1.44.0.00.045","Vaduz Zimmerschützen",1,0,0,1,"Aktiv-A G10m","","A","LizenzG10m","Herr","",0,1,"01.01.2023","","","",0,"1.44.0.00.045","Vaduz Zimmerschützen","","","","Aktiv","Newsletter Email","Abonnement","27.07.2023","","Nein","Nein","","","","","",1,"01.12.2023 14:27"]
["1869251","002125","Mihajlo","Trubarac","","","Sarganserstr. 56","8887","Mels","CH","","","","","mihajlo.trubarac@kks-mels.ch","","Männlich","09.08.2005","","Deutsch","CH","1.44.0.00.027","Mels Kleinkaliberschützen",1,0,0,1,"Aktiv-A G50m","","A","LizenzG50m","Herr","",0,0,"02.05.2023","","","",0,"1.44.0.00.027","Mels Kleinkaliberschützen","","","","Aktiv","Newsletter Email","Abonnement","02.05.2023","","Nein","Nein","","","","","",1,"01.12.2023 14:27"]
["1084169","136086","Peter","Benz","","","Wiesenstr. 4","9463","Oberriet SG","CH","","","071 761 25 88","079 738 62 38\t\t","pe.benz@bluewin.ch","","Männlich","15.04.1965","","Deutsch","CH","1.44.0.00.045","Vaduz Zimmerschützen",1,0,0,1,"Aktiv-B G10m","","B","LizenzG10m","Herr","",0,0,"26.09.2023","","","",0,"1.05.0.02.028","Galgenen Infanterieschiessverein","","","","Aktiv","Newsletter Email","Abonnement","27.07.2023","","Nein","Nein","","","","","",1,"01.12.2023 14:27"]
["1747856","819759","Patrick","Willi","","","Neugutstr. 9","8888","Heiligkreuz (Mels)","CH","","","","","patrick.willi@kks-mels.ch","","Männlich","11.05.2000","756.5997.7990.76","Deutsch","CH","1.44.0.00.027","Mels Kleinkaliberschützen",1,0,0,1,"Aktiv-A G50m","","A","LizenzG50m","Herr","",0,0,"18.04.2019","","","",0,"1.17.0.06.052","Mels Schützenverein","","","","Aktiv","","Abonnement","27.07.2023","","Nein","","","","","","",1,"01.12.2023 14:27"]
["2196278","002132","Nils","Kamm","","","Quartnerstrasse 12","8883","Quarten","CH","","","","","nils.kamm@kks-mels.ch","","Männlich","24.09.2007","","Deutsch","CH","1.44.0.00.027","Mels Kleinkaliberschützen",1,0,0,1,"Aktiv-A G50m","","A","LizenzG50m","","",0,0,"02.05.2023","","","",0,"1.44.0.00.027","Mels Kleinkaliberschützen","","","","Aktiv","Newsletter Email","Abonnement","02.05.2023","","Nein","Nein","","","","","",1,"01.12.2023 14:27"]
["1869253","002144","Orlando","Pfiffner","","","Parfannastr. 41","8887","Mels","CH","","","","","orlando.pfiffner@kks-mels.ch","","Männlich","14.01.2007","","Deutsch","CH","1.44.0.00.027","Mels Kleinkaliberschützen",1,0,0,1,"Aktiv-A G50m","","A","LizenzG50m","Herr","",0,0,"02.05.2023","","","",0,"1.44.0.00.027","Mels Kleinkaliberschützen","","","","Aktiv","Newsletter Email","Abonnement","02.05.2023","","Nein","Nein","","","","","",1,"01.12.2023 14:27"]
["1682075","749157","Celine","Kalberer","","","Bleesstr. 5","8887","Mels","CH","","","081 710 56 10","079 171 59 70","celinekalberer@hotmail.com","www.fsgwangs.ch","Weiblich","17.11.1999","","Deutsch","CH","1.44.0.00.045","Vaduz Zimmerschützen",1,0,0,1,"Aktiv-B G10m","","B","LizenzG10m","Frau","",0,1,"26.09.2023","","","",0,"1.44.0.00.033","Sargans Sportschützen","","","","Aktiv","Newsletter Email","Abonnement","27.07.2023","","Nein","Nein","","","","","",1,"01.12.2023 14:27"]
["2196281","002134","Martin","Drabik","","","Rheinstrasse 35","7320","Sargans","CH","","","","","martin.drabik@kks-mels.ch","","Männlich","20.03.1981","","","SK","1.44.0.00.027","Mels Kleinkaliberschützen",1,0,0,1,"Aktiv-A G50m","","A","LizenzG50m","Herr","",0,0,"25.03.2023","","","",0,"1.44.0.00.027","Mels Kleinkaliberschützen","","","","Aktiv","Newsletter Email","Abonnement","25.03.2023","","Nein","Nein","","","","","",1,"01.12.2023 14:27"]
["1060717","112632","Daniel","Meierhofer","","","Hauptstr. 17","9320","Arbon","CH","","","071 446 16 18","","dmeierhofer57@gmail.com","","Männlich","26.11.1964","","Deutsch","CH","1.44.0.00.037","Sitterdorf Sportschützen",1,0,0,1,"Aktiv-A G10m","","A","LizenzG10m","Herr","",0,0,"18.10.2020","","","",0,"1.20.0.01.014","Arbon-Roggwil, Tälischützen","","","","Aktiv","Newsletter Email","","","","","Nein","","","","","","","01.12.2023 14:27"]
["1060717","112632","Daniel","Meierhofer","","","Hauptstr. 17","9320","Arbon","CH","","","071 446 16 18","","dmeierhofer57@gmail.com","","Männlich","26.11.1964","","Deutsch","CH","1.44.0.00.037","Sitterdorf Sportschützen",1,0,0,1,"Aktiv-A G50m","","A","LizenzG50m","Herr","",0,0,"29.06.2020","","","",0,"1.20.0.01.014","Arbon-Roggwil, Tälischützen","","","","Aktiv","Newsletter Email","","","","","Nein","","","","","","","01.12.2023 14:27"]
["1821127","898059","Tobias","Auer","","","Hummelbergstr. 7A","9216","Hohentannen","CH","","","","","","","Männlich","11.07.2005","","Deutsch","CH","1.44.0.00.037","Sitterdorf Sportschützen",1,0,0,1,"Aktiv-A G50m","","A","LizenzG50m","Herr","",0,0,"11.02.2023","","","",0,"1.44.0.00.037","Sitterdorf Sportschützen","","","","Aktiv","Newsletter Email","Abonnement","27.07.2023","","Nein","Nein","","","","","",1,"01.12.2023 14:27"]
["1061577","113492","Michael","Wymann","","Postfach 22","Ebnaterstr. 39","9642","Ebnat-Kappel","CH","","","","","","","Männlich","25.03.1979","","Deutsch","CH","1.44.0.00.055","Dicken Ebnat-Kappel Sportschützen",1,0,0,1,"Aktiv-A G50m","","A","LizenzG50m","Herr","",0,1,"01.01.2023","","","",0,"1.44.0.00.055","Dicken Ebnat-Kappel Sportschützen","","","","Aktiv","Newsletter Email","Abonnement","27.07.2023","","Nein","Nein","","","","","",1,"01.12.2023 14:27"]
["1033539","010227","Lena","Frei","","","Martinsbruggstr. 98 a","9016","St. Gallen","CH","","","","","","","Weiblich","22.09.2004","756.8185.7265.19","Deutsch","CH","1.44.0.00.037","Sitterdorf Sportschützen",1,0,0,1,"Aktiv-A G50m","","A","LizenzG50m","Frau","",0,0,"01.01.2023","","","",0,"1.44.0.00.037","Sitterdorf Sportschützen","","","","Aktiv","Newsletter Email","","","","","Nein","","","","","","","01.12.2023 14:27"]
["1039819","016561","Ramona","Mäder","","","Obere Hagenwilerstr. 2","8588","Zihlschlacht","CH","","","","","","","Weiblich","13.06.2008","","Deutsch","CH","1.44.0.00.037","Sitterdorf Sportschützen",1,0,0,1,"Aktiv-A G50m","","A","LizenzG50m","Frau","",0,0,"11.02.2023","","","",0,"1.44.0.00.037","Sitterdorf Sportschützen","","","","Aktiv","Newsletter Email","Abonnement","27.07.2023","","Nein","Nein","","","","","",1,"01.12.2023 14:27"]
["1039819","016561","Ramona","Mäder","","","Obere Hagenwilerstr. 2","8588","Zihlschlacht","CH","","","","","","","Weiblich","13.06.2008","","Deutsch","CH","1.44.0.00.037","Sitterdorf Sportschützen",1,0,0,1,"Aktiv-A G10m","","A","LizenzG10m","Frau","",0,0,"10.10.2022","","","",0,"1.44.0.00.037","Sitterdorf Sportschützen","","","","Aktiv","Newsletter Email","Abonnement","27.07.2023","","Nein","Nein","","","","","",1,"01.12.2023 14:27"]
["1232444","284371","Werner","Schreiber","","","Bahnhofstr. 4","9220","Bischofszell","CH","","","071 422 40 86","079 441 60 70","schreiberw@bluewin.ch","","Männlich","03.04.1963","","Deutsch","CH","1.44.0.00.037","Sitterdorf Sportschützen",1,0,0,1,"Aktiv-A G10m","","A","LizenzG10m","Herr","",0,0,"06.11.2019","","","",0,"1.44.0.00.037","Sitterdorf Sportschützen","","","","Aktiv","Newsletter Email","Abonnement","27.07.2023","","Nein","Nein","","","","","",1,"01.12.2023 14:27"]
["1232444","284371","Werner","Schreiber","","","Bahnhofstr. 4","9220","Bischofszell","CH","","","071 422 40 86","079 441 60 70","schreiberw@bluewin.ch","","Männlich","03.04.1963","","Deutsch","CH","1.44.0.00.037","Sitterdorf Sportschützen",1,0,0,1,"Aktiv-A G50m","","A","LizenzG50m","Herr","",0,0,"22.03.2007","","","",0,"1.44.0.00.037","Sitterdorf Sportschützen","","","","Aktiv","Newsletter Email","Abonnement","27.07.2023","","Nein","Nein","","","","","",1,"01.12.2023 14:27"]
["1060680","112595","Adolf","Dobler","","","Schulhausstr. 5","9057","Schwende","CH","","","071 797 00 38","077 471 41 97","schaefler57@bluewin.ch","","Männlich","22.05.1957","","Deutsch","CH","1.44.0.00.002","Appenzell Luftgewehrsektion",1,0,0,1,"Aktiv-A G10m","","A","LizenzG10m","Herr","",0,0,"01.01.2023","","","",0,"1.16.0.00.021","Schwende, SV Uli Rotach-Schwende","","","","Aktiv","Newsletter Email","Abonnement","27.07.2023","","Nein","Nein","","","","","",1,"01.12.2023 14:27"]
["1243830","295757","Florian","Dobler","","","Nollentrasse 23a","9050","Appenzell","CH","","","","077 443 87 41","florian.dobler@bluewin.ch","","Männlich","22.03.1993","","Deutsch","CH","1.44.0.00.002","Appenzell Luftgewehrsektion",1,0,0,1,"Aktiv-A G10m","","A","LizenzG10m","Herr","",0,1,"01.01.2023","","","",0,"1.44.0.00.002","Appenzell Luftgewehrsektion","","","","Aktiv","Kein Newsletter","Abonnement","27.07.2023","","Nein","Nein","","","","","",1,"01.12.2023 14:27"]
["1079595","131511","Sepp","Räss","","","Bilchenstr. 22","9050","Eggerstanden","CH","","","071 787 28 67","079 205 81 33","sepp.raess@bluewin.ch","","Männlich","08.04.1966","756.8234.0483.64","Deutsch","CH","1.44.0.00.002","Appenzell Luftgewehrsektion",1,0,0,1,"Aktiv-A G10m","","A","LizenzG10m","Herr","",0,1,"05.10.2016","","","",0,"1.16.0.00.002","Eggerstanden, Schützenverein","","","","Aktiv","Newsletter Email","Abonnement","27.07.2023","","Nein","Nein","","","","","",1,"01.12.2023 14:27"]
["1060898","112813","Barbara","Infanger","","","Riethüslistr. 3","9012","St. Gallen","CH","","","071 277 02 36","","","","Weiblich","27.04.1957","","Deutsch","CH","1.44.0.00.012","Egnach Sportschützen",1,0,0,1,"Aktiv-A G50m","","A","LizenzG50m","Frau","barbara.infanger@bluewin.ch",0,1,"01.01.2023","","","",0,"1.44.0.00.012","Egnach Sportschützen","","","","Aktiv","Newsletter Email","Abonnement","27.07.2023","","Nein","Nein","","","","","",1,"01.12.2023 14:27"]
["1910848","991811","Louis","Ulrich","","","Forrenstr. 9","9050","Appenzell","CH","","","","","","","Männlich","14.09.2007","756.9879.1127.00","Deutsch","CH","1.44.0.00.002","Appenzell Luftgewehrsektion",1,0,0,1,"Aktiv-A G10m","","A","LizenzG10m","Herr","",0,0,"01.01.2023","","","",0,"1.44.0.00.002","Appenzell Luftgewehrsektion","","","","Aktiv","Newsletter Email","Abonnement","27.07.2023","","Nein","Nein","","","","","",1,"01.12.2023 14:27"]
["1758222","830925","Jan","Ulmann","","","Gaiserstrasse 196","9050","Appenzell Meistersrüte","CH","","","071 787 56 04","079 791 79 99","jan.ulmann03@gmail.com","","Männlich","19.10.2003","756.9707.5826.99","Deutsch","CH","1.44.0.00.002","Appenzell Luftgewehrsektion",1,0,0,1,"Aktiv-A G10m","","A","LizenzG10m","Herr","",0,0,"14.10.2020","","","",0,"1.16.0.00.006","Clanx, Schützengesellschaft Appenzell","","","","Aktiv","Newsletter Email","Abonnement","27.07.2023","","Nein","Nein","","","","","",1,"01.12.2023 14:27"]
["1910846","991809","Lara","Manser","","","Rütistr. 47","9050","Appenzell","CH","","","","","","","Weiblich","05.05.2008","","Deutsch","CH","1.44.0.00.002","Appenzell Luftgewehrsektion",1,0,0,1,"Aktiv-A G10m","","A","LizenzG10m","Frau","",0,1,"01.01.2023","","","",0,"1.44.0.00.002","Appenzell Luftgewehrsektion","","","","Aktiv","Newsletter Email","Abonnement","27.07.2023","","Nein","Nein","","","","","",1,"01.12.2023 14:27"]
["1856844","935365","Andy","Menzi","","","Langgreut 6","9322","Egnach","CH","","","","","","","Männlich","07.11.1973","","Deutsch","CH","1.44.0.00.012","Egnach Sportschützen",1,0,0,1,"Aktiv-A G50m","","A","LizenzG50m","Herr","",0,1,"01.01.2023","","","",0,"1.44.0.00.012","Egnach Sportschützen","","","","Aktiv","Newsletter Email","Abonnement","27.07.2023","","Nein","Nein","","","","","",1,"01.12.2023 14:27"]
["1257035","308963","Sandro","Greuter","","","Im Stoffel 15","8887","Mels","CH","","","081 723 61 90","079 641 65 35","sandro.greuter@hotmail.com","","Männlich","25.02.1993","756.5248.7430.18","Deutsch","CH","1.44.0.00.033","Sargans Sportschützen",1,0,0,1,"Aktiv-A G50m","","A","LizenzG50m","Herr","",0,0,"08.04.2007","","","",0,"1.44.0.00.033","Sargans Sportschützen","","","","Aktiv","","Abonnement","27.07.2023","","Nein","","","","","","",1,"01.12.2023 14:27"]
["1061293","113208","Fritz","Reinhard","","","Bergackerstr. 3","8585","Zuben","CH","","","071 690 06 56","079 744 86 41","reinhard.fritz@bluewin.ch","","Männlich","20.04.1947","756.8428.2558.82","Deutsch","CH","1.44.0.00.034","Schönenbaumgarten Sportschützen",1,0,0,1,"Aktiv-A G50m","","A","LizenzG50m","Herr","",0,1,"01.01.2023","","","",0,"1.20.0.05.005","Alterswilen Handrohrschützen","","","","Aktiv","Newsletter Email","Abonnement","27.07.2023","","Nein","Nein","","","","","",1,"01.12.2023 14:27"]
["1061308","113223","Josef","Stachel","","","Gerbestr. 20","8595","Altnau","CH","","","071 695 10 46","079 216 14 50","stachel@tbaltnau.ch","","Männlich","12.07.1948","","Deutsch","CH","1.44.0.00.034","Schönenbaumgarten Sportschützen",1,0,0,1,"Aktiv-A G50m","","A","LizenzG50m","Herr","",0,1,"01.01.2023","","","",0,"1.20.0.05.007","Altnau-Langrickenbach Schützen","","","","Aktiv","Newsletter Email","Abonnement","27.07.2023","","Nein","Nein","","","","","",1,"01.12.2023 14:27"]
["1061099","113014","Hans","Herzog","","","Remis 92","9533","Dietschwil","CH","","","071 931 37 76","078 710 52 25","herzogremis@bluewin.ch","","Männlich","18.03.1943","","Deutsch","CH","1.44.0.00.022","Kirchberg Sportschützen",1,0,0,1,"Aktiv-A G50m","","A","LizenzG50m","Herr","",0,0,"01.01.2023","","","",0,"1.17.0.10.024","Dietschwil Schützenverein","","","","Aktiv","Newsletter Email","Abonnement","27.07.2023","","Nein","Nein","","","","","",1,"01.12.2023 14:27"]
["1830905","908501","Markus","Wernli","","","Leuchen 427","9428","Walzenhausen","CH","","","0765790388","","wernli.markus@hotmail.com","","Männlich","23.11.1955","","Deutsch","CH","1.44.0.00.053","Wolfhalden Sportschützen",1,0,0,1,"Aktiv-A G50m","","A","LizenzG50m","Herr","",0,0,"01.03.2021","","","",0,"1.17.0.04.058","Montlingen Feldschützengesellschaft","","","","Aktiv","Newsletter Email","Abonnement","27.07.2023","","Nein","Nein","","","","","",1,"01.12.2023 14:27"]
["1146600","198521","Karl","Reinhart","","","Eggethof 100","8585","Langrickenbach","CH","","","071 411 63 85","","reinhart.karl@freesurf.ch","","Männlich","24.10.1952","","Deutsch","CH","1.44.0.00.034","Schönenbaumgarten Sportschützen",1,0,0,1,"Aktiv-A G50m","","A","LizenzG50m","Herr","",0,1,"01.01.2005","","","",0,"1.20.0.05.007","Altnau-Langrickenbach Schützen","","","","Aktiv","Newsletter Email","Abonnement","27.07.2023","","Nein","Nein","","","","","",1,"01.12.2023 14:27"]
["1061102","113017","Paul","Mäder","","","Boolwisstr. 20","9533","Dietschwil","CH","","","071 931 46 41","079 246 10 21","paul.maeder17@bluewin.ch","","Männlich","17.11.1956","756.4334.6786.23","Deutsch","CH","1.44.0.00.022","Kirchberg Sportschützen",1,0,0,1,"Aktiv-A G50m","","A","LizenzG50m","Herr","",0,0,"01.01.1998","","","",0,"1.17.0.10.024","Dietschwil Schützenverein","","","","Aktiv","Newsletter Email","Abonnement","27.07.2023","","Nein","Nein","","","","","",1,"01.12.2023 14:27"]
["1721301","791385","Sara","Bartholdi","","","Obidörfli 16","9220","Bischofszell","CH","","","","","sara.bartholdi@bluewin.ch","","Weiblich","22.03.2001","","Deutsch","CH","1.44.0.00.037","Sitterdorf Sportschützen",1,0,0,1,"Aktiv-A G50m","","A","LizenzG50m","Frau","",0,0,"01.04.2015","","","",0,"1.44.0.00.037","Sitterdorf Sportschützen","","","","Aktiv","Newsletter Email","","","","","Nein","","","","","","","01.12.2023 14:27"]
["1721301","791385","Sara","Bartholdi","","","Obidörfli 16","9220","Bischofszell","CH","","","","","sara.bartholdi@bluewin.ch","","Weiblich","22.03.2001","","Deutsch","CH","1.44.0.00.037","Sitterdorf Sportschützen",1,0,0,1,"Aktiv-A G10m","","A","LizenzG10m","Frau","",0,0,"01.04.2015","","","",0,"1.44.0.00.037","Sitterdorf Sportschützen","","","","Aktiv","Newsletter Email","","","","","Nein","","","","","","","01.12.2023 14:27"]
["1896680","977183","Alisa","Oppliger","","","Horben 3200","9642","Ebnat-Kappel","CH","","","","","","","Weiblich","01.01.2005","756.4359.4948.26","Deutsch","CH","1.44.0.00.055","Dicken Ebnat-Kappel Sportschützen",1,0,0,1,"Aktiv-A G50m","","A","LizenzG50m","Frau","",0,0,"08.05.2022","","","",0,"1.44.0.00.055","Dicken Ebnat-Kappel Sportschützen","","","","Aktiv","Newsletter Email","Abonnement","27.07.2023","","Nein","Nein","","","","","",1,"01.12.2023 14:27"]
["1078342","130258","Brigitte","Baumann","","","Dorf 929","9651","Ennetbühl","CH","","","","+41 79 314 79 24","brigittebaumann@bluewin.ch","","Weiblich","24.10.1978","756.2379.5151.32","Deutsch","CH","1.44.0.00.055","Dicken Ebnat-Kappel Sportschützen",1,0,0,1,"Aktiv-A G50m","","A","LizenzG50m","Frau","",0,0,"01.01.2023","","","",0,"1.44.0.00.055","Dicken Ebnat-Kappel Sportschützen","","","","Aktiv","Newsletter Email","Abonnement","27.07.2023","","Nein","Nein","","","","","",1,"01.12.2023 14:27"]
["1851690","930061","Roman","Geisser","","","Kapplerstr. 25","9642","Ebnat-Kappel","CH","","","","","geisserroman@gmail.com","","Männlich","17.12.2006","","Deutsch","CH","1.44.0.00.055","Dicken Ebnat-Kappel Sportschützen",1,0,0,1,"Aktiv-A G50m","","A","LizenzG50m","Herr","",0,1,"08.05.2022","","","",0,"1.44.0.00.011","Ebnat-Kappel & Umgebung Luftgewehrsektion","","","","Aktiv","Newsletter Email","Abonnement","27.07.2023","","Nein","Nein","","","","","",1,"01.12.2023 14:27"]
["1276378","328308","Vanessa","Beck","","","Zihlschlachtstr. 2","9216","Hohentannen","CH","","","","","vanii.beck@hotmail.com","","Weiblich","05.02.1996","","Deutsch","CH","1.44.0.00.037","Sitterdorf Sportschützen",1,0,0,1,"Aktiv-A G50m","","A","LizenzG50m","Frau","",0,0,"01.03.2009","","","",0,"1.20.0.01.078","Hohentannen-Heldswil Feldschützenverein","","","","Aktiv","Newsletter Email","Abonnement","27.07.2023","","Nein","Nein","","","","","",1,"01.12.2023 14:27"]
["1276038","327968","Marina","Schmitz","","","Stockenerstr. 2b","9220","Bischofszell","CH","","","","","marina_schmitz@hotmail.ch","","Weiblich","14.11.1994","","Deutsch","CH","1.44.0.00.037","Sitterdorf Sportschützen",1,0,0,1,"Aktiv-A G50m","","A","LizenzG50m","Frau","",0,0,"09.03.2015","","","",0,"1.44.0.00.037","Sitterdorf Sportschützen","","","","Aktiv","Newsletter Email","","","","","Nein","","","","","","","01.12.2023 14:27"]
["1060866","112781","Erhard","Hüppi","","","Steinenbachstr. 22","9642","Ebnat-Kappel","CH","079 209 96 43","","071 993 29 07","079 209 96 43","erhard.hueppi@bluewin.ch","","Männlich","18.06.1954","","Deutsch","CH","1.44.0.00.055","Dicken Ebnat-Kappel Sportschützen",1,0,0,1,"Aktiv-A G50m","","A","LizenzG50m","Herr","erhard.hueppi@bluewin.ch",0,0,"01.01.2023","","","",0,"1.44.0.00.055","Dicken Ebnat-Kappel Sportschützen","","","","Aktiv","Newsletter Email","Abonnement","27.07.2023","","Nein","Nein","","","","","",1,"01.12.2023 14:27"]
["1821131","898063","Tobias","Lengwiler","","","Lauften 4","9225","Wilen Gottshaus","CH","","","","","","","Männlich","20.10.2003","","Deutsch","CH","1.44.0.00.037","Sitterdorf Sportschützen",1,0,0,1,"Aktiv-A G50m","","A","LizenzG50m","Herr","",0,1,"01.04.2016","","","",0,"1.44.0.00.037","Sitterdorf Sportschützen","","","","Aktiv","Newsletter Email","","","","","Nein","","","","","","","01.12.2023 14:27"]
["1257035","308963","Sandro","Greuter","","","Im Stoffel 15","8887","Mels","CH","","","081 723 61 90","079 641 65 35","sandro.greuter@hotmail.com","","Männlich","25.02.1993","756.5248.7430.18","Deutsch","CH","1.44.0.00.033","Sargans Sportschützen",1,0,0,1,"Aktiv-B G10m","","B","LizenzG10m","Herr","",0,0,"08.04.2007","","","",0,"1.44.0.00.033","Sargans Sportschützen","","","","Aktiv","","Abonnement","27.07.2023","","Nein","","","","","","",1,"01.12.2023 14:27"]
["1192710","244636","Emil","Straub","","","Wiesenring 15","8590","Romanshorn","CH","","","052 335 34 53","","holder6@bluewin.ch","","Männlich","29.02.1948","","Deutsch","CH","1.44.0.00.012","Egnach Sportschützen",1,0,0,1,"Aktiv-A G50m","","A","LizenzG50m","Herr","",0,0,"01.01.2023","","","",0,"1.44.0.00.012","Egnach Sportschützen","","","","Aktiv","Newsletter Email","Abonnement","27.07.2023","","Nein","Nein","","","","","",1,"01.12.2023 14:27"]
["1074565","126481","Beat","Hug","","","Käsereiweg 12","9312","Häggenschwil","CH","","","071 290 18 23","","info@tiertherapie.ch","","Männlich","18.02.1967","","Deutsch","CH","1.44.0.00.012","Egnach Sportschützen",1,0,0,1,"Aktiv-A G50m","","A","LizenzG50m","Herr","",0,0,"01.04.2011","","","",0,"1.44.0.00.012","Egnach Sportschützen","","","","Aktiv","","Abonnement","27.07.2023","","Nein","","","","","","",1,"01.12.2023 14:27"]
["1060901","112816","Hans-Jürgen","Lebherz","","","Wilenstr. 5","9322","Egnach","CH","","","071 477 15 39","","hagileb@hispeed.ch","","Männlich","15.07.1949","","Deutsch","CH","1.44.0.00.012","Egnach Sportschützen",1,0,0,1,"Aktiv-A G50m","","A","LizenzG50m","Herr","",0,1,"01.01.2023","","","",0,"1.44.0.00.012","Egnach Sportschützen","","","","Aktiv","Newsletter Email","Abonnement","27.07.2023","","Nein","Nein","","","","","",1,"01.12.2023 14:27"]
["1058387","110302","Brigitte","Egli","","","Annabergstr. 7","8882","Unterterzen","CH","","","","079 395 95 89","begli68@bluewin.ch","","Weiblich","04.05.1968","","Deutsch","CH","1.44.0.00.033","Sargans Sportschützen",1,0,0,1,"Aktiv-A G10m","","A","LizenzG10m","Frau","",0,0,"25.11.2016","","","",0,"1.44.0.00.033","Sargans Sportschützen","","","","Aktiv","","","","","","","","","","","","","01.12.2023 14:27"]
["1058387","110302","Brigitte","Egli","","","Annabergstr. 7","8882","Unterterzen","CH","","","","079 395 95 89","begli68@bluewin.ch","","Weiblich","04.05.1968","","Deutsch","CH","1.44.0.00.033","Sargans Sportschützen",1,0,0,1,"Aktiv-A G50m","","A","LizenzG50m","Frau","",0,0,"25.11.2016","","","",0,"1.44.0.00.033","Sargans Sportschützen","","","","Aktiv","","","","","","","","","","","","","01.12.2023 14:27"]
["1899786","980464","Jana","Schmid","","","Schulstr. 4","8597","Landschlacht","CH","","","","","","","Weiblich","01.05.1994","","Deutsch","CH","1.44.0.00.012","Egnach Sportschützen",1,0,0,1,"Aktiv-A G50m","","A","LizenzG50m","Frau","",0,0,"01.01.2023","","","",0,"1.44.0.00.012","Egnach Sportschützen","","","","Aktiv","Newsletter Email","Abonnement","27.07.2023","","Nein","Nein","","","","","",1,"01.12.2023 14:27"]
["1057010","108925","Hanspeter","Brütsch","","","Schwedenweg 433","8262","Ramsen","CH","","","052 743 12 19","","","","Männlich","22.03.1945","","Deutsch","CH","1.44.0.00.020","Wagenhausen-Stein am Rhein Sportschützen",1,0,0,1,"Aktiv-A G50m","","A","LizenzG50m","Herr","",0,0,"01.01.2023","","","",0,"1.14.0.04.034","Ramsen Schützenverein","","","","Aktiv","","Abonnement","27.07.2023","","Nein","","","","","","",1,"01.12.2023 14:27"]
["1084169","136086","Peter","Benz","","","Wiesenstr. 4","9463","Oberriet SG","CH","","","071 761 25 88","079 738 62 38\t\t","pe.benz@bluewin.ch","","Männlich","15.04.1965","","Deutsch","CH","1.44.0.00.033","Sargans Sportschützen",1,0,0,1,"Aktiv-A G10m","","A","LizenzG10m","Herr","",0,0,"02.10.2008","","","",0,"1.05.0.02.028","Galgenen Infanterieschiessverein","","","","Aktiv","Newsletter Email","Abonnement","27.07.2023","","Nein","Nein","","","","","",1,"01.12.2023 14:27"]
["1086509","138426","Robert","Muralt","","","Maria-Stader-Weg 7","8590","Romanshorn","CH","","","","078 880 01 61","orpheas@bluewin.ch","","Männlich","06.05.1955","756.6792.0241.65","Deutsch","CH","1.44.0.00.019","Hatswil Sportschützen",1,0,0,1,"Aktiv-A G50m","","A","LizenzG50m","Herr","",0,1,"05.03.2020","","","",0,"1.20.0.01.120","Egnach-Romanshorn Schützengesellschaft","","","","Aktiv","Newsletter Email","Abonnement","27.07.2023","","Nein","Nein","","","","","",1,"01.12.2023 14:27"]
["1607208","669162","Roger","Sonderer","","","Eggerstandenstr. 71","9050","Appenzell","CH","","","","","","","Männlich","28.09.1991","","Deutsch","CH","1.44.0.00.050","Weissbad Sportschützen",1,0,0,1,"Aktiv-A G50m","","A","LizenzG50m","Herr","",0,1,"04.04.2013","","","",0,"1.16.0.00.003","Ried, Infanterieschützenverein Appenzell","","","","Aktiv","Newsletter Email","","","","","Nein","","","","","","","01.12.2023 14:27"]
["1801998","877809","Maurus","Fritsche","","","Sonnhalde 15","9050","Appenzell","CH","","","","","","","Männlich","07.05.2002","756.7837.6721.50","Deutsch","CH","1.44.0.00.050","Weissbad Sportschützen",1,0,0,1,"Aktiv-A G50m","","A","LizenzG50m","Herr","",0,0,"24.04.2019","","","",0,"1.44.0.00.050","Weissbad Sportschützen","","","","Aktiv","Newsletter Email","","","","","Nein","","","","","","","01.12.2023 14:27"]
["1272945","324875","Nina","Suter","","","Hueb 74","9200","Gossau SG","CH","","","","078 822 29 84","ninasuter@sunrise.ch","","Weiblich","02.02.1998","","Deutsch","CH","1.44.0.00.011","Ebnat-Kappel & Umgebung Luftgewehrsektion",1,0,0,1,"Aktiv-A G10m","","A","LizenzG10m","Frau","",0,1,"01.10.2015","","","",0,"1.17.0.01.128","Wittenbach Schützengesellschaft","","","","Aktiv","","","","","","","","","","","","","01.12.2023 14:27"]
["1238283","290210","Martin","Streule","","","Dorf 8a","9057","Weissbad","CH","","","071 799 13 85","079 733 49 12","martin_streule@gmx.ch","","Männlich","12.01.1990","756.7116.8682.74","Deutsch","CH","1.44.0.00.050","Weissbad Sportschützen",1,0,0,1,"Aktiv-A G50m","","A","LizenzG50m","Herr","",0,0,"01.01.2023","","","",0,"1.16.0.00.006","Clanx, Schützengesellschaft Appenzell","","","","Aktiv","","Abonnement","27.07.2023","","Nein","","","","","","",1,"01.12.2023 14:27"]
["1758221","830924","Sven","Städler","","","Gadenstatt 12","9050","Appenzell Meistersrüte","CH","","","071 787 80 11","078 858 04 55","sven.staedler131@gmail.com","","Männlich","04.12.2003","756.3792.4963.05","Deutsch","CH","1.44.0.00.050","Weissbad Sportschützen",1,0,0,1,"Aktiv-A G50m","","A","LizenzG50m","Herr","",0,0,"01.04.2023","","","",0,"1.16.0.00.006","Clanx, Schützengesellschaft Appenzell","","","","Aktiv","Newsletter Email","Abonnement","27.07.2023","","Nein","Nein","","","","","",1,"01.12.2023 14:27"]
["1060777","112692","Christian","Stäheli","","","Büntwisenstr. 11","9205","Waldkirch","CH","+41 58 4759133","","+41 71 411 92 05","+41 79 323 70 17","staeheli68@bluewin.ch","","Männlich","19.08.1968","756.8755.7513.09","Deutsch","CH","1.44.0.00.019","Hatswil Sportschützen",1,0,0,1,"Aktiv-A G50m","","A","LizenzG50m","Herr","christian.staeheli@ffb-group.ch",0,0,"01.03.1997","","","",0,"1.44.0.00.019","Hatswil Sportschützen","","","","Aktiv","Newsletter Email","Abonnement","27.07.2023","","Nein","Nein","","","","","",1,"01.12.2023 14:27"]
["1060705","112620","Patrick","Wetter","","","Zistli 4","9050","Appenzell Steinegg","CH","","","071 787 43 80","078 924 90 31","wetter.p@gmail.com","","Männlich","15.10.1984","756.2159.2673.50","Deutsch","CH","1.44.0.00.050","Weissbad Sportschützen",1,0,0,1,"Aktiv-A G50m","","A","LizenzG50m","Herr","",0,1,"16.03.2006","","","",0,"1.16.0.00.002","Eggerstanden, Schützenverein","","","","Aktiv","Newsletter Email","Abonnement","27.07.2023","","Nein","Nein","","","","","",1,"01.12.2023 14:27"]
["1094468","146385","Lukas","Walser","","","Torfneststr. 5","9413","Oberegg","CH","","","0715701656","0787350577","lukas@walser.ai","","Männlich","25.02.1989","756.2326.5285.74","Deutsch","CH","1.44.0.00.031","Oberegg Luftgewehrsektion",1,0,0,1,"Aktiv-A G10m","","A","LizenzG10m","Herr","",0,0,"01.01.2005","","","",0,"1.16.0.00.017","Oberegg, Feldschützen","","","","Aktiv","Newsletter Email","Abonnement","27.07.2023","","Nein","Nein","","","","","",1,"01.12.2023 14:27"]
["1540372","600695","Gunnar","Schallert","","","Schulstr. 51","6710","Nenzing","AT","","","","","schallert.gunnar@cable.vol.at","","Männlich","15.03.1970","","Deutsch","AT","1.44.0.00.045","Vaduz Zimmerschützen",1,0,0,1,"Aktiv-A G10m","","A","LizenzG10m","Herr","",0,1,"01.01.2023","","","",0,"1.44.0.00.045","Vaduz Zimmerschützen","","","","Aktiv","Newsletter Email","Abonnement","27.07.2023","18.09.2023","Nein","Nein","","","","","",1,"01.12.2023 14:27"]
["2196284","002154","Manuel","Good","","","Kleinfeldweg 3","8887","Mels","CH","","","","","manuel.good@kks-mels.ch","","Männlich","07.01.2010","","Deutsch","CH","1.44.0.00.027","Mels Kleinkaliberschützen",1,0,0,1,"Aktiv-A G50m","","A","LizenzG50m","","",0,0,"02.05.2023","","","",0,"1.44.0.00.027","Mels Kleinkaliberschützen","","","","Aktiv","Newsletter Email","Abonnement","02.05.2023","","Nein","Nein","","","","","",1,"01.12.2023 14:27"]
["1725665","796297","Elias","Kaiser","","","Wegacker 14","9493","Mauren","LI","","","","","","","Männlich","13.02.2003","","Deutsch","LI","1.44.0.00.058","Eschen Sportschützen",1,0,0,1,"Aktiv-A G10m","","A","LizenzG10m","Herr","",0,1,"01.01.2014","","","",0,"1.44.0.00.058","Eschen Sportschützen","","","","Aktiv","Newsletter Email","Abonnement","27.07.2023","","Nein","Nein","","","","","",1,"01.12.2023 14:27"]
["1707614","776401","Roger","Hilbe","","","Am Schrägen Weg 17","9490","Vaduz","LI","","","","","","","Männlich","15.01.1977","","Deutsch","LI","1.44.0.00.027","Mels Kleinkaliberschützen",1,0,0,1,"Aktiv-A G50m","","A","LizenzG50m","Herr","",0,0,"04.03.2022","","","",0,"1.44.0.00.027","Mels Kleinkaliberschützen","","","","Aktiv","","Abonnement","27.07.2023","","Nein","","","","","","",1,"01.12.2023 14:27"]
["1732865","803859","Aurelia","Jehle","","","Im Bartledura 21","9494","Schaan","LI","","","+423 / 232 02 00","","fredy.jehle@risch.ch","","Weiblich","15.01.2003","","Deutsch","CH","1.44.0.00.058","Eschen Sportschützen",1,0,0,1,"Aktiv-A G10m","","A","LizenzG10m","Frau","",0,1,"26.08.2015","","","",0,"1.44.0.00.058","Eschen Sportschützen","","","","Aktiv","","","","","","","","","","","","","01.12.2023 14:27"]
["1190372","242298","Michael","Mattle","","","Storchenbühel 8","9492","Eschen","LI","","","+423 373 37 91","","praesident@ssem.li","","Männlich","20.04.1990","","Deutsch","LI","1.44.0.00.045","Vaduz Zimmerschützen",1,0,0,1,"Aktiv-B G10m","","B","LizenzG10m","Herr","",0,1,"15.10.2010","","","",0,"1.44.0.00.058","Eschen Sportschützen","","","","Aktiv","Newsletter Email","Abonnement","27.07.2023","","Nein","Nein","","","","","",1,"01.12.2023 14:27"]
["1190372","242298","Michael","Mattle","","","Storchenbühel 8","9492","Eschen","LI","","","+423 373 37 91","","praesident@ssem.li","","Männlich","20.04.1990","","Deutsch","LI","1.44.0.00.058","Eschen Sportschützen",1,0,0,1,"Aktiv-A G10m","","A","LizenzG10m","Herr","",0,1,"01.01.2023","","","",0,"1.44.0.00.058","Eschen Sportschützen","","","","Aktiv","Newsletter Email","Abonnement","27.07.2023","","Nein","Nein","","","","","",1,"01.12.2023 14:27"]
["1801380","877173","Noel","Grünenfelder","","","Lindenweg 5","8889","Plons","CH","","","","","noel.gruenenfelder@kks-mels.ch","","Männlich","27.05.2002","756.4986.0849.19","Deutsch","CH","1.44.0.00.027","Mels Kleinkaliberschützen",1,0,0,1,"Aktiv-A G50m","","A","LizenzG50m","Herr","",0,0,"25.02.2023","","","",0,"1.44.0.00.027","Mels Kleinkaliberschützen","","","","Aktiv","","Abonnement","27.07.2023","","Nein","","","","","","",1,"01.12.2023 14:27"]
["1243805","295732","Dieter","Grabner","","","Ebenhochgasse 10","6840","Götzis","AT","","","","","dieter.grabner@gmx.net","","Männlich","08.06.1972","","Deutsch","AT","1.44.0.00.045","Vaduz Zimmerschützen",1,0,0,1,"Aktiv-A G10m","","A","LizenzG10m","Herr","",0,1,"01.01.2023","","","",0,"1.44.0.00.045","Vaduz Zimmerschützen","","","","Aktiv","Newsletter Email","Abonnement","27.07.2023","18.09.2023","Nein","Nein","","","","","",1,"01.12.2023 14:27"]
["1061572","113487","Werner","Leuzinger","","","Gillstrasse 10","9642","Ebnat-Kappel","CH","","","071 993 18 04","","blumebrandholz@bluewin.ch","","Männlich","17.01.1943","756.6497.0394.40","Deutsch","CH","1.44.0.00.055","Dicken Ebnat-Kappel Sportschützen",1,0,0,1,"Aktiv-A G50m","","A","LizenzG50m","Herr","",0,1,"01.01.2023","","","",0,"1.17.0.09.022","Ebnat-Kappel Schützenverein","","","","Aktiv","Kein Newsletter","Abonnement","27.07.2023","","Nein","Nein","","","","","",1,"01.12.2023 14:27"]
["1855969","934456","Ian","Künzli","","","Howartstr. 22","9642","Ebnat-Kappel","CH","","","","","","","Männlich","15.07.2006","","Deutsch","CH","1.44.0.00.055","Dicken Ebnat-Kappel Sportschützen",1,0,0,1,"Aktiv-A G50m","","A","LizenzG50m","Herr","",0,0,"01.03.2021","","","",0,"1.44.0.00.011","Ebnat-Kappel & Umgebung Luftgewehrsektion","","","","Aktiv","Newsletter Email","Abonnement","27.07.2023","","Nein","Nein","","","","","",1,"01.12.2023 14:27"]
["1061567","113482","Heini","Bösch","","","Ebnaterstr. 6","9642","Ebnat-Kappel","CH","","","071 993 21 22","","","","Männlich","25.11.1936","756.1444.0454.44","Deutsch","CH","1.44.0.00.055","Dicken Ebnat-Kappel Sportschützen",1,0,0,1,"Aktiv-A G50m","","A","LizenzG50m","Herr","",0,1,"01.01.2023","","","",0,"1.44.0.00.055","Dicken Ebnat-Kappel Sportschützen","","","","Aktiv","Newsletter Email","Abonnement","27.07.2023","","Nein","Nein","","","","","",1,"01.12.2023 14:27"]
["1222384","274311","Albert","Wagner","","","Pestalozzistr. 17","9320","Arbon","CH","","","","079 790 88 70","wagneralbert079@gmail.com","","Männlich","27.12.1963","","Deutsch","CH","1.44.0.00.037","Sitterdorf Sportschützen",1,0,0,1,"Aktiv-A G10m","","A","LizenzG10m","Herr","",0,0,"06.11.2019","","","",0,"1.20.0.01.013","Arbon Pistolenschützen","","","","Aktiv","Newsletter Email","Abonnement","27.07.2023","","Nein","Nein","","","","","",1,"01.12.2023 14:27"]
["1222384","274311","Albert","Wagner","","","Pestalozzistr. 17","9320","Arbon","CH","","","","079 790 88 70","wagneralbert079@gmail.com","","Männlich","27.12.1963","","Deutsch","CH","1.44.0.00.037","Sitterdorf Sportschützen",1,0,0,1,"Aktiv-A G50m","","A","LizenzG50m","Herr","",0,0,"01.05.2007","","","",0,"1.20.0.01.013","Arbon Pistolenschützen","","","","Aktiv","Newsletter Email","Abonnement","27.07.2023","","Nein","Nein","","","","","",1,"01.12.2023 14:27"]
["1206551","258477","Remo","Wild","","","Thuraustr. 44","9642","Ebnat-Kappel","CH","","","071 990 02 71","079 892 40 49","remow76@hotmail.com","","Männlich","15.06.1976","756.7328.5713.99","Deutsch","CH","1.44.0.00.055","Dicken Ebnat-Kappel Sportschützen",1,0,0,1,"Aktiv-A G50m","","A","LizenzG50m","Herr","",0,0,"30.03.2010","","","",0,"1.17.0.09.022","Ebnat-Kappel Schützenverein","","","","Aktiv","Newsletter Email","Abonnement","27.07.2023","","Nein","Nein","","","","","",1,"01.12.2023 14:27"]
["1060884","112799","Hans","Scherrer","","","Berglistr. 54","9642","Ebnat-Kappel","CH","","","","","","","Männlich","22.05.1954","","Deutsch","CH","1.44.0.00.055","Dicken Ebnat-Kappel Sportschützen",1,0,0,1,"Aktiv-A G50m","","A","LizenzG50m","Herr","",0,0,"01.01.2023","","","",0,"1.44.0.00.055","Dicken Ebnat-Kappel Sportschützen","","","","Aktiv","Newsletter Email","Abonnement","27.07.2023","","Nein","Nein","","","","","",1,"01.12.2023 14:27"]
["1060865","112780","Roman","Hollenstein","","","Berglistr. 34","9642","Ebnat-Kappel","CH","071 992 66 88","","071 993 32 71","","","","Männlich","13.09.1958","","Deutsch","CH","1.44.0.00.055","Dicken Ebnat-Kappel Sportschützen",1,0,0,1,"Aktiv-A G50m","","A","LizenzG50m","Herr","",0,0,"01.01.2023","","","",0,"1.44.0.00.055","Dicken Ebnat-Kappel Sportschützen","","","","Aktiv","Newsletter Email","Abonnement","27.07.2023","","Nein","Nein","","","","","",1,"01.12.2023 14:27"]
["1279484","331415","Marc","Schmitz","","","Sittpark 5","8589","Sitterdorf","CH","","","","0764167602","marcschmitz14@gmail.com","","Männlich","30.09.1992","","Deutsch","CH","1.44.0.00.037","Sitterdorf Sportschützen",1,0,0,1,"Aktiv-A G50m","","A","LizenzG50m","Herr","",0,0,"01.03.2009","","","",0,"1.44.0.00.037","Sitterdorf Sportschützen","","","","Aktiv","Kein Newsletter","Abonnement","27.07.2023","","Nein","Nein","","","","","",1,"01.12.2023 14:27"]
["1205434","257360","Patrick","Good","","","Churfirstenweg 5","7324","Vilters","CH","","","","","pidlu@hispeed.ch","","Männlich","16.03.1982","756.8267.9573.29","Deutsch","CH","1.44.0.00.033","Sargans Sportschützen",1,0,0,1,"Aktiv-A G50m","","A","LizenzG50m","Herr","",0,0,"13.02.2013","","","",0,"1.17.0.06.101","Vilters Militärschützenverein","","","","Aktiv","Newsletter Email","Abonnement","27.07.2023","","Nein","Nein","","","","","",1,"01.12.2023 14:27"]
["1061270","113185","Martin","Nauer","","","Furggelsstr. 20","7313","St. Margrethenberg","CH","","","081 302 15 46","079 380 84 22","martin.nauer@rsnweb.ch","","Männlich","22.04.1942","756.9071.6130.43","Deutsch","CH","1.44.0.00.033","Sargans Sportschützen",1,0,0,1,"Aktiv-A G10m","","A","LizenzG10m","Herr","",0,1,"01.01.2023","","","",0,"1.17.0.06.052","Mels Schützenverein","","","","Aktiv","Newsletter Email","Abonnement","27.07.2023","","Nein","Nein","","","","","",1,"01.12.2023 14:27"]
["1029029","005676","Valentin","Fromm","","","Hochwangstr. 21","7304","Maienfeld","CH","","","","","","","Männlich","28.12.2008","","Deutsch","CH","1.44.0.00.033","Sargans Sportschützen",0,0,0,1,"Aktiv-A G50m","","A","LizenzG50m","Herr","",0,1,"01.01.2023","","","",0,"1.44.0.00.033","Sargans Sportschützen","","","","Aktiv","Newsletter Email","Abonnement","27.07.2023","","Nein","Nein","","","04.09.2023","","",1,"01.12.2023 14:27"]
["1869851","949160","Cedric","Good","","","Rosenstr. 15A","7320","Sargans","CH","","","081 723 05 12","","renate.ruegg@bluewin.ch","","Männlich","18.01.2009","","Deutsch","CH","1.44.0.00.033","Sargans Sportschützen",1,0,0,1,"Aktiv-A G50m","","A","LizenzG50m","Herr","",0,0,"14.12.2019","","","",0,"1.44.0.00.033","Sargans Sportschützen","","","","Aktiv","","","","","","","","","","","","","01.12.2023 14:27"]
["1869851","949160","Cedric","Good","","","Rosenstr. 15A","7320","Sargans","CH","","","081 723 05 12","","renate.ruegg@bluewin.ch","","Männlich","18.01.2009","","Deutsch","CH","1.44.0.00.033","Sargans Sportschützen",1,0,0,1,"Aktiv-A G10m","","A","LizenzG10m","Herr","",0,0,"15.10.2022","","","",0,"1.44.0.00.033","Sargans Sportschützen","","","","Aktiv","","","","","","","","","","","","","01.12.2023 14:27"]
["1682075","749157","Celine","Kalberer","","","Bleesstr. 5","8887","Mels","CH","","","081 710 56 10","079 171 59 70","celinekalberer@hotmail.com","www.fsgwangs.ch","Weiblich","17.11.1999","","Deutsch","CH","1.44.0.00.033","Sargans Sportschützen",1,0,0,1,"Aktiv-A G50m","","A","LizenzG50m","Frau","",0,1,"15.04.2014","","","",0,"1.44.0.00.033","Sargans Sportschützen","","","","Aktiv","Newsletter Email","Abonnement","27.07.2023","","Nein","Nein","","","","","",1,"01.12.2023 14:27"]
["1682075","749157","Celine","Kalberer","","","Bleesstr. 5","8887","Mels","CH","","","081 710 56 10","079 171 59 70","celinekalberer@hotmail.com","www.fsgwangs.ch","Weiblich","17.11.1999","","Deutsch","CH","1.44.0.00.033","Sargans Sportschützen",1,0,0,1,"Aktiv-A G10m","","A","LizenzG10m","Frau","",0,1,"16.04.2014","","","",0,"1.44.0.00.033","Sargans Sportschützen","","","","Aktiv","Newsletter Email","Abonnement","27.07.2023","","Nein","Nein","","","","","",1,"01.12.2023 14:27"]
["1057056","108971","Conrad","Krönlein","","","Untergasse 13 B","8260","Stein am Rhein","CH","052 624 20 01","","052 741 22 32","","conradkroenlein@bluewin.ch","","Männlich","17.02.1944","","Deutsch","CH","1.44.0.00.020","Wagenhausen-Stein am Rhein Sportschützen",1,0,0,1,"Aktiv-A G50m","","A","LizenzG50m","Herr","",0,0,"08.03.2013","","","",0,"1.14.0.04.034","Ramsen Schützenverein","","","","Aktiv","Newsletter Email","Abonnement","27.07.2023","","Nein","Nein","","","","","",1,"01.12.2023 14:27"]
["1078103","130019","Thomas","Weber","","","Propstei 12","8259","Wagenhausen","CH","","","","079 285 91 67","rtweber@bluewin.ch","","Männlich","18.04.1958","","Deutsch","CH","1.44.0.00.020","Wagenhausen-Stein am Rhein Sportschützen",1,0,0,1,"Aktiv-A G50m","","A","LizenzG50m","Herr","",0,1,"01.01.2023","","","",0,"1.44.0.00.020","Wagenhausen-Stein am Rhein Sportschützen","","","","Aktiv","Newsletter Email","Abonnement","27.07.2023","","Nein","Nein","","","","","",1,"01.12.2023 14:27"]
["1060774","112689","Marcel","Schilliger","","","Städeliweg 5","9220","Bischofszell","CH","","","071 422 43 13","078 646 77 82","mschilliger@bluewin.ch","","Männlich","26.06.1981","756.9933.3369.43","Deutsch","CH","1.44.0.00.055","Dicken Ebnat-Kappel Sportschützen",1,0,0,1,"Aktiv-A G50m","","A","LizenzG50m","Herr","praesident@ospsv.ch",0,1,"01.01.2023","","","",0,"1.44.0.00.007","Bischofszell Sportschützen","","","","Aktiv","Newsletter Email","Abonnement","27.07.2023","","Nein","Nein","","","","","",1,"01.12.2023 14:27"]
["1222383","274310","Markus","Wagner","","","Wattistr. 14","8580","Amriswil","CH","","","","079 234 34 11","mwagi@bluewin.ch","","Männlich","06.12.1965","756.6251.3272.40","Deutsch","CH","1.44.0.00.037","Sitterdorf Sportschützen",1,0,0,1,"Aktiv-A G50m","","A","LizenzG50m","Herr","",0,0,"01.08.2008","","","",0,"1.20.0.01.014","Arbon-Roggwil, Tälischützen","","","","Aktiv","Newsletter Email","Abonnement","27.07.2023","","Nein","Nein","","","","","",1,"01.12.2023 14:27"]
["1222383","274310","Markus","Wagner","","","Wattistr. 14","8580","Amriswil","CH","","","","079 234 34 11","mwagi@bluewin.ch","","Männlich","06.12.1965","756.6251.3272.40","Deutsch","CH","1.44.0.00.037","Sitterdorf Sportschützen",1,0,0,1,"Aktiv-A G10m","","A","LizenzG10m","Herr","",0,0,"18.10.2020","","","",0,"1.20.0.01.014","Arbon-Roggwil, Tälischützen","","","","Aktiv","Newsletter Email","Abonnement","27.07.2023","","Nein","Nein","","","","","",1,"01.12.2023 14:27"]
["1099668","151586","Peter","Beck","","","Bildstr. 1","9216","Hohentannen","CH","","","071 422 61 79","","imbild.beck@bluewin.ch","","Männlich","17.05.1969","","Deutsch","CH","1.44.0.00.037","Sitterdorf Sportschützen",1,0,0,1,"Aktiv-A G50m","","A","LizenzG50m","Herr","",0,1,"01.01.2023","","","",0,"1.20.0.01.078","Hohentannen-Heldswil Feldschützenverein","","","","Aktiv","Newsletter Email","Abonnement","27.07.2023","","Nein","Nein","","","","","",1,"01.12.2023 14:27"]
["1060871","112786","Markus","Künzli","","","Howartstr. 22","9642","Ebnat-Kappel","CH","","","071 993 21 10","","aktuar@kkdicken.ch","","Männlich","10.05.1974","","Deutsch","CH","1.44.0.00.055","Dicken Ebnat-Kappel Sportschützen",1,0,0,1,"Aktiv-A G50m","","A","LizenzG50m","Herr","",0,0,"01.01.2023","","","",0,"1.44.0.00.055","Dicken Ebnat-Kappel Sportschützen","","","","Aktiv","Newsletter Email","Abonnement","27.07.2023","","Nein","Nein","","","","","",1,"01.12.2023 14:27"]
["1234670","286597","Karin","Scherrer","","","Bürerfeld 16A","9245","Oberbüren","CH","","","","","","","Weiblich","29.02.1992","","Deutsch","CH","1.44.0.00.055","Dicken Ebnat-Kappel Sportschützen",1,0,0,1,"Aktiv-A G50m","","A","LizenzG50m","Frau","",0,0,"01.01.2023","","","",0,"1.44.0.00.055","Dicken Ebnat-Kappel Sportschützen","","","","Aktiv","Newsletter Email","Abonnement","27.07.2023","","Nein","Nein","","","","","",1,"01.12.2023 14:27"]
["1060867","112782","Iwan","Hüppi","","","Felsensteinstr. 16","9642","Ebnat-Kappel","CH","","","071 565 42 72","","iwan.hueppi@bluewin.ch","","Männlich","05.10.1980","","Deutsch","CH","1.44.0.00.055","Dicken Ebnat-Kappel Sportschützen",1,0,0,1,"Aktiv-A G50m","","A","LizenzG50m","Herr","",0,0,"01.01.2023","","","",0,"1.44.0.00.055","Dicken Ebnat-Kappel Sportschützen","","","","Aktiv","Newsletter Email","Abonnement","27.07.2023","","Nein","Nein","","","","","",1,"01.12.2023 14:27"]
["1738804","810047","Anouk","Fässler","","","Höhenweg 31","9642","Ebnat-Kappel","CH","","","","","anouk.faessler@thurweb.ch","","Weiblich","04.02.2006","","Deutsch","CH","1.44.0.00.055","Dicken Ebnat-Kappel Sportschützen",1,0,0,1,"Aktiv-A G50m","","A","LizenzG50m","Frau","",0,1,"01.03.2021","","","",0,"1.44.0.00.011","Ebnat-Kappel & Umgebung Luftgewehrsektion","","","","Aktiv","Newsletter Email","Abonnement","27.07.2023","","Nein","Nein","","","","","",1,"01.12.2023 14:27"]
["1060868","112783","Marlen","Schilliger","","","Städeliweg 5","9220","Bischofszell","CH","","","071 422 43 13","071 993 29 07","mschilliger@bluewin.ch","","Weiblich","02.10.1983","","Deutsch","CH","1.44.0.00.055","Dicken Ebnat-Kappel Sportschützen",1,0,0,1,"Aktiv-A G50m","","A","LizenzG50m","Frau","",0,0,"01.01.2023","","","",0,"1.44.0.00.055","Dicken Ebnat-Kappel Sportschützen","","","","Aktiv","Newsletter Email","Abonnement","27.07.2023","","Nein","Nein","","","","","",1,"01.12.2023 14:27"]
["1860133","938932","Susi","Jäggi","","","Hungerbühl 28","8599","Salmsach","CH","","","","","susi.jaeggi@gmx.ch","","Weiblich","15.04.1969","","Deutsch","CH","1.44.0.00.019","Hatswil Sportschützen",1,0,0,1,"Aktiv-A G50m","","A","LizenzG50m","Frau","",0,1,"05.03.2023","","","",0,"1.01.0.08.066","Hittnau Schützengesellschaft","","","","Aktiv","","","","","","","","","","","","","01.12.2023 14:27"]
["1222328","274255","Manuel Ramon","Inauen","","","Obere Hirschbergstr. 12","9050","Appenzell","CH","","","071 787 47 51","079 794 19 87","manuel.inauen@gmail.com","","Männlich","23.09.1987","756.5933.6011.04","Deutsch","CH","1.44.0.00.050","Weissbad Sportschützen",1,0,0,1,"Aktiv-A G50m","","A","LizenzG50m","Herr","",0,0,"12.03.2003","","","",0,"1.16.0.00.006","Clanx, Schützengesellschaft Appenzell","","","","Aktiv","Newsletter Email","Abonnement","27.07.2023","","Nein","Nein","","","","","",1,"01.12.2023 14:27"]
["1061481","113396","Urs","Fuster","","","unteres Ziel 3","9050","Appenzell","CH","","","071 787 11 65","","mac.ufuster@bluewin.ch","","Männlich","10.08.1953","756.4892.8189.98","Deutsch","CH","1.44.0.00.050","Weissbad Sportschützen",1,0,0,1,"Aktiv-A G50m","","A","LizenzG50m","Herr","",0,1,"01.01.2023","","","",0,"1.16.0.00.001","Appenzell, Schützenverein","","","","Aktiv","Newsletter Email","","","","","Nein","","","","","","","01.12.2023 14:27"]
["1078342","130258","Brigitte","Baumann","","","Dorf 929","9651","Ennetbühl","CH","","","","+41 79 314 79 24","brigittebaumann@bluewin.ch","","Weiblich","24.10.1978","756.2379.5151.32","Deutsch","CH","1.44.0.00.011","Ebnat-Kappel & Umgebung Luftgewehrsektion",1,0,0,1,"Aktiv-A G10m Auflage","","A","LizenzG10m","Frau","",0,0,"16.10.2023","","","",0,"1.44.0.00.055","Dicken Ebnat-Kappel Sportschützen","","","","Aktiv","Newsletter Email","Abonnement","27.07.2023","","Nein","Nein","","","","","",1,"01.12.2023 14:27"]
["1078342","130258","Brigitte","Baumann","","","Dorf 929","9651","Ennetbühl","CH","","","","+41 79 314 79 24","brigittebaumann@bluewin.ch","","Weiblich","24.10.1978","756.2379.5151.32","Deutsch","CH","1.44.0.00.011","Ebnat-Kappel & Umgebung Luftgewehrsektion",1,0,0,1,"Aktiv-A G10m","","A","LizenzG10m","Frau","",0,0,"01.01.2023","","","",0,"1.44.0.00.055","Dicken Ebnat-Kappel Sportschützen","","","","Aktiv","Newsletter Email","Abonnement","27.07.2023","","Nein","Nein","","","","","",1,"01.12.2023 14:27"]
["1060680","112595","Adolf","Dobler","","","Schulhausstr. 5","9057","Schwende","CH","","","071 797 00 38","077 471 41 97","schaefler57@bluewin.ch","","Männlich","22.05.1957","","Deutsch","CH","1.44.0.00.050","Weissbad Sportschützen",1,0,0,1,"Aktiv-A G50m","","A","LizenzG50m","Herr","",0,0,"01.01.2023","","","",0,"1.16.0.00.021","Schwende, SV Uli Rotach-Schwende","","","","Aktiv","Newsletter Email","Abonnement","27.07.2023","","Nein","Nein","","","","","",1,"01.12.2023 14:27"]
["1061046","112961","Rolf","Meyer","","","Kesswilerstr. 11","8582","Dozwil","CH","071 411 38 28","","071 463 73 75","079 449 54 30","r.meyer@sportgarage-meyer.ch","","Männlich","21.12.1968","","Deutsch","CH","1.44.0.00.019","Hatswil Sportschützen",1,0,0,1,"Aktiv-A G50m","","A","LizenzG50m","Herr","r.meyer@sportgarage-meyer.ch",0,1,"11.03.1997","","","",0,"1.20.0.01.040","Hefenhofen-Dozwil Schützengesellschaft","","","","Aktiv","Newsletter Email","Abonnement","27.07.2023","","Nein","Nein","","","","","",1,"01.12.2023 14:27"]
["1061229","113144","Guido","Bischofberger","","","Sondereggstr. 14","9413","Oberegg","CH","","","071 891 46 51","","sonderegg@bluewin.ch","","Männlich","14.11.1968","","Deutsch","CH","1.44.0.00.031","Oberegg Luftgewehrsektion",1,0,0,1,"Aktiv-A G10m","","A","LizenzG10m","Herr","",0,0,"01.01.1989","","","",0,"1.44.0.00.031","Oberegg Luftgewehrsektion","","","","Aktiv","Newsletter Email","Abonnement","27.07.2023","","Nein","Nein","","","","","",1,"01.12.2023 14:27"]
["1061173","113088","Othmar","Bless","","","Kettweg 1","8880","Walenstadt","CH","","","081 735 10 56","","","","Männlich","04.07.1946","","Deutsch","CH","1.44.0.00.027","Mels Kleinkaliberschützen",1,0,0,1,"Aktiv-A G50m","","A","LizenzG50m","Herr","",0,0,"01.08.2011","","","",0,"1.17.0.06.064","Oberterzen SV Quarten-Oberterzen","","","","Aktiv","","Abonnement","27.07.2023","","Nein","","","","","","",1,"01.12.2023 14:27"]
["1779880","853946","Daniel","Tunyogi","","","Leginglen 7","7320","Sargans","CH","","","","076 704 94 86","danitunyogi@gmail.com","","Männlich","03.09.2003","","Deutsch","HU","1.44.0.00.045","Vaduz Zimmerschützen",1,0,0,1,"Aktiv-B G10m","","B","LizenzG10m","Herr","",0,0,"30.09.2023","","","",0,"1.44.0.00.033","Sargans Sportschützen","","","","Aktiv","","","","","","","","","","","","","01.12.2023 14:27"]
["1061001","112916","Arinette","Moser","","","Fürstenstr. 41","9496","Balzers","LI","","","","+423 792 33 73","arinette.hasler@gmail.com","","Weiblich","27.09.1968","","Deutsch","CH","1.44.0.00.045","Vaduz Zimmerschützen",1,0,0,1,"Aktiv-B G10m","","B","LizenzG10m","Frau","",0,1,"01.01.2023","","","",0,"1.44.0.00.017","Grabs Sportschützen","","","","Aktiv","Newsletter Email","Abonnement","27.07.2023","18.09.2023","Nein","Nein","","","","","",1,"01.12.2023 14:27"]
["1061001","112916","Arinette","Moser","","","Fürstenstr. 41","9496","Balzers","LI","","","","+423 792 33 73","arinette.hasler@gmail.com","","Weiblich","27.09.1968","","Deutsch","CH","1.44.0.00.017","Grabs Sportschützen",1,0,0,1,"Aktiv-A G50m","","A","LizenzG50m","Frau","",0,1,"01.01.2023","","","",0,"1.44.0.00.017","Grabs Sportschützen","","","","Aktiv","Newsletter Email","Abonnement","27.07.2023","18.09.2023","Nein","Nein","","","","","",1,"01.12.2023 14:27"]
["1600485","662427","Flavia","Frey","","","Vilterserstr. 20","7323","Wangs","CH","","","081 723 04 36","077 411 19 25","freyalpiger@hispeed.ch","","Weiblich","15.09.2000","","Deutsch","CH","1.44.0.00.027","Mels Kleinkaliberschützen",1,0,0,1,"Aktiv-A G50m","","A","LizenzG50m","Frau","",0,0,"30.10.2019","","","",0,"1.17.0.06.108","Wangs Militärschützenverein","","","","Aktiv","","Abonnement","27.07.2023","","Nein","","","","","","",1,"01.12.2023 14:27"]
["1085493","137410","René","Keller","","","Hintergasse 5","7312","Pfäfers","CH","081 302 17 52","","081 302 17 52","079 509 45 21","info@baeckerei-keller.ch","","Männlich","30.10.1969","756.8989.5950.07","Deutsch","CH","1.44.0.00.027","Mels Kleinkaliberschützen",1,0,0,1,"Aktiv-A G50m","","A","LizenzG50m","Herr","",0,1,"04.03.2022","","","",0,"1.17.0.06.065","Pfäfers Schützengesellschaft Taminaschützen","","","","Aktiv","Newsletter Email","Abonnement","27.07.2023","","Nein","Nein","","","","","",1,"01.12.2023 14:27"]
["1875854","002123","Maurus","Gantner","","","Täliweg 43","8887","Mels","CH","","","","","maurusgantner2006@gmail.com","","Männlich","07.05.2006","","Deutsch","CH","1.44.0.00.027","Mels Kleinkaliberschützen",1,0,0,1,"Aktiv-A G50m","","A","LizenzG50m","Herr","",0,0,"02.05.2023","","","",0,"1.44.0.00.027","Mels Kleinkaliberschützen","","","","Aktiv","Newsletter Email","Abonnement","02.05.2023","","Nein","Nein","","","","","",1,"01.12.2023 14:27"]
["1720604","790650","Leonie","Mautz","","","Pralawisch 23","9496","Balzers","LI","","","","","","","Weiblich","14.04.2004","","Deutsch","LI","1.44.0.00.045","Vaduz Zimmerschützen",1,0,0,1,"Aktiv-A G10m","","A","LizenzG10m","Frau","",0,1,"01.01.2023","","","",0,"1.44.0.00.045","Vaduz Zimmerschützen","","","","Aktiv","Newsletter Email","","","","","Nein","","","","","","","01.12.2023 14:27"]
["1898484","002124","Luca","Willi","","","Winkelstr.32a","8887","Mels","CH","","","","","luca.willi@kks-mels.ch","","Männlich","17.07.2008","","Deutsch","CH","1.44.0.00.027","Mels Kleinkaliberschützen",1,0,0,1,"Aktiv-A G50m","","A","LizenzG50m","Herr","",0,0,"02.05.2023","","","",0,"1.44.0.00.027","Mels Kleinkaliberschützen","","","","Aktiv","Newsletter Email","Abonnement","02.05.2023","","Nein","Nein","","","","","",1,"01.12.2023 14:27"]
["1477535","529472","Martina","Kaiser","","","Alvierstr. 11","9470","Buchs","CH","","","081 771 13 65","","kaiser.martina@hotmail.com","","Weiblich","15.03.1996","","Deutsch","CH","1.44.0.00.055","Dicken Ebnat-Kappel Sportschützen",1,0,0,1,"Aktiv-B G50m","","B","LizenzG50m","Frau","",0,1,"01.01.2023","","","",0,"1.44.0.00.017","Grabs Sportschützen","","","","Aktiv","Newsletter Email","Abonnement","27.07.2023","","Nein","Nein","","","","","",1,"01.12.2023 14:27"]
["1060879","112794","Reto","Mettler","ASPARAGUS ENGINEERING AG","","Mühlebergstr. 1","8450","Andelfingen","CH","052 320 57 36","","052 301 37 57","","remettler@bluewin.ch","","Männlich","10.05.1975","","Deutsch","CH","1.44.0.00.055","Dicken Ebnat-Kappel Sportschützen",1,0,0,1,"Aktiv-A G50m","","A","LizenzG50m","Herr","reto.mettler@vitodata.ch",0,0,"01.01.2023","","","",0,"1.44.0.00.055","Dicken Ebnat-Kappel Sportschützen","","","","Aktiv","","Abonnement","27.07.2023","","Nein","","","","","","",1,"01.12.2023 14:27"]
["1060883","112798","Franco","Santoro","SFS Santoro Financial Services","","Schrennenstr. 9","8733","Eschenbach SG","CH","055 535 03 03","","","078 790 23 65","franco.santoro@gmx.ch","","Männlich","18.01.1971","","Deutsch","CH","1.44.0.00.055","Dicken Ebnat-Kappel Sportschützen",1,0,0,1,"Aktiv-A G50m","","A","LizenzG50m","Herr","",0,0,"01.01.2023","","","",0,"1.44.0.00.055","Dicken Ebnat-Kappel Sportschützen","","","","Aktiv","Newsletter Email","","","","","Nein","","","","","","","01.12.2023 14:27"]
["1060870","112785","Hanspeter","Künzli","","","Howartstr. 33","9642","Ebnat-Kappel","CH","","","071 993 29 16","079 815 69 60","hanspeterkuenzli@thurweb.ch","","Männlich","06.04.1967","756.3605.1740.17","Deutsch","CH","1.44.0.00.055","Dicken Ebnat-Kappel Sportschützen",1,0,0,1,"Aktiv-A G50m","","A","LizenzG50m","Herr","",0,0,"16.03.2022","","","",0,"1.44.0.00.055","Dicken Ebnat-Kappel Sportschützen","","","","Aktiv","","Abonnement","27.07.2023","","Nein","","","","","","",1,"01.12.2023 14:27"]
["1060861","112776","Martin","Hartmann","","","Stegweidstr. 4","8496","Steg","CH","","","","","","","Männlich","24.11.1972","","Deutsch","CH","1.44.0.00.055","Dicken Ebnat-Kappel Sportschützen",1,0,0,1,"Aktiv-A G50m","","A","LizenzG50m","Herr","",0,1,"01.01.2023","","","",0,"1.44.0.00.055","Dicken Ebnat-Kappel Sportschützen","","","","Aktiv","Newsletter Email","","","","","Nein","","","","","","","01.12.2023 14:27"]
["1040072","016816","Marco","Schlegel","","","Breitschachenstr. 8b","9032","Engelburg","CH","","","0792236993","0792236993","m.schlegel@ymail.com","","Männlich","16.01.1974","","Deutsch","CH","1.44.0.00.012","Egnach Sportschützen",1,0,0,1,"Aktiv-A G50m","","A","LizenzG50m","Herr","",0,1,"01.01.2023","","","",0,"1.44.0.00.012","Egnach Sportschützen","","","","Aktiv","Newsletter Email","Abonnement","27.07.2023","","Nein","Nein","","","","","",1,"01.12.2023 14:27"]
["1909580","990516","William","Munskgaard","","","Feldweg 1a","7324","Vilters","CH","","","","","","","Männlich","15.11.2007","","Deutsch","DK","1.44.0.00.033","Sargans Sportschützen",0,0,0,1,"Aktiv-A G50m","","A","LizenzG50m","Herr","",0,0,"01.01.2023","","","",0,"1.44.0.00.033","Sargans Sportschützen","","","","Aktiv","Newsletter Email","Abonnement","27.07.2023","","Nein","Nein","","","04.09.2023","","",1,"01.12.2023 14:27"]
["1061010","112925","Roger","Lenherr","","","Neufeld 21","9473","Gams","CH","","","","079 262 76 68","rogerlenherr@gmx.ch","","Männlich","14.07.1982","756.0658.3673.35","Deutsch","CH","1.44.0.00.033","Sargans Sportschützen",1,0,0,1,"Aktiv-A G50m","","A","LizenzG50m","Herr","",0,1,"14.02.2010","","","",0,"1.44.0.00.033","Sargans Sportschützen","","","","Aktiv","Newsletter Email","Abonnement","27.07.2023","","Nein","Nein","","","","","",1,"01.12.2023 14:27"]
["1061261","113176","Paul","Hermann","","","Ragazerstr. 40","7320","Sargans","CH","","","081 723 33 94","","","","Männlich","29.07.1936","","Deutsch","CH","1.44.0.00.033","Sargans Sportschützen",1,0,0,1,"Aktiv-A G50m","","A","LizenzG50m","Herr","",0,1,"09.01.1969","","","",0,"1.44.0.00.033","Sargans Sportschützen","","","","Aktiv","Newsletter Email","","","","","Nein","","","","","","","01.12.2023 14:27"]
["1779880","853946","Daniel","Tunyogi","","","Leginglen 7","7320","Sargans","CH","","","","076 704 94 86","danitunyogi@gmail.com","","Männlich","03.09.2003","","Deutsch","HU","1.44.0.00.033","Sargans Sportschützen",1,0,0,1,"Aktiv-A G50m","","A","LizenzG50m","Herr","",0,0,"12.11.2016","","","",0,"1.44.0.00.033","Sargans Sportschützen","","","","Aktiv","","","","","","","","","","","","","01.12.2023 14:27"]
["1779880","853946","Daniel","Tunyogi","","","Leginglen 7","7320","Sargans","CH","","","","076 704 94 86","danitunyogi@gmail.com","","Männlich","03.09.2003","","Deutsch","HU","1.44.0.00.033","Sargans Sportschützen",1,0,0,1,"Aktiv-A G10m","","A","LizenzG10m","Herr","",0,0,"01.01.2023","","","",0,"1.44.0.00.033","Sargans Sportschützen","","","","Aktiv","","","","","","","","","","","","","01.12.2023 14:27"]
["1696079","764142","Sven","Beyer","","","Mooswiesen 5","9322","Egnach","CH","","","","","","","Männlich","11.04.1995","756.1554.4126.62","Deutsch","CH","1.44.0.00.012","Egnach Sportschützen",1,0,0,1,"Aktiv-A G50m","","A","LizenzG50m","Herr","",0,1,"01.12.2019","","","",0,"1.44.0.00.012","Egnach Sportschützen","","","","Aktiv","Newsletter Email","Abonnement","27.07.2023","","Nein","Nein","","","","","",1,"01.12.2023 14:27"]
["1078077","129993","Alfred","Ehrismann","","","Feldhofstr. 32","8500","Frauenfeld","CH","","","","079 706 04 68","ehrismann@stafag.ch","","Männlich","10.02.1957","","Deutsch","CH","1.44.0.00.020","Wagenhausen-Stein am Rhein Sportschützen",1,0,0,1,"Aktiv-A G50m","","A","LizenzG50m","Herr","",0,0,"01.01.2023","","","",0,"1.44.0.00.020","Wagenhausen-Stein am Rhein Sportschützen","","","","Aktiv","Newsletter Email","","","","","Nein","","","","","","","01.12.2023 14:27"]
["1878938","958697","Zsombor","Lengyel","","","Leginglen 7","7320","Sargans","CH","","","","076 / 779 23 25","zolka23@yahoo.com","","Männlich","02.09.2006","","Deutsch","HU","1.44.0.00.033","Sargans Sportschützen",1,0,0,1,"Aktiv-A G50m","","A","LizenzG50m","Herr","",0,0,"14.12.2019","","","",0,"1.44.0.00.033","Sargans Sportschützen","","","","Aktiv","Newsletter Email","Abonnement","27.07.2023","","Nein","Nein","","","","","",1,"01.12.2023 14:27"]
["1152122","204045","Philip","Schlegel","Norma","","Schulhausstr. 1","7323","Wangs","CH","","","081 723 22 00","","","","Männlich","23.01.1988","756.0862.4323.24","Deutsch","CH","1.44.0.00.027","Mels Kleinkaliberschützen",1,0,0,1,"Aktiv-A G50m","","A","LizenzG50m","Herr","",0,1,"29.03.2017","","","",0,"1.17.0.06.052","Mels Schützenverein","","","","Aktiv","Newsletter Email","Abonnement","27.07.2023","","Nein","Nein","","","","","",1,"01.12.2023 14:27"]
["1747854","819757","Andrin","Gantner","","","Täliweg 43","8887","Mels","CH","","","","078 917 68 00","andringantner@gmail.com","","Männlich","10.10.2001","756.4227.3949.51","Deutsch","CH","1.44.0.00.027","Mels Kleinkaliberschützen",1,0,0,1,"Aktiv-A G50m","","A","LizenzG50m","Herr","",0,0,"04.03.2022","","","",0,"1.44.0.00.027","Mels Kleinkaliberschützen","","","","Aktiv","","","","","","","","","","","","","01.12.2023 14:27"]
["1813538","890149","Rahim","Pacolli","","","Palduinstr. 10","9496","Balzers","LI","","","","","florim@powersurf.li","","Männlich","02.10.2007","","Deutsch","LI","1.44.0.00.045","Vaduz Zimmerschützen",1,0,0,1,"Aktiv-A G10m","","A","LizenzG10m","Herr","",0,1,"01.01.2023","","","",0,"1.44.0.00.045","Vaduz Zimmerschützen","","","","Aktiv","Newsletter Email","","","","","Nein","","","","","","","01.12.2023 14:27"]
["1875853","955431","Balint","Almasi","","","Felsweg 6","8887","Mels","CH","","","","","balint.almasi@kks-mels.ch","","Männlich","30.06.1980","","Deutsch","CH","1.44.0.00.027","Mels Kleinkaliberschützen",1,0,0,1,"Aktiv-A G50m","","A","LizenzG50m","Herr","",0,0,"31.03.2019","","","",0,"1.44.0.00.027","Mels Kleinkaliberschützen","","","","Aktiv","","Abonnement","27.07.2023","","Nein","","","","","","",1,"01.12.2023 14:27"]
["1061328","113243","Josef","Brendle","","","Schellenbergerstr. 42","9488","Schellenberg","LI","","","","","josef.brendle@adon.li","","Männlich","08.06.1949","","Deutsch","LI","1.44.0.00.045","Vaduz Zimmerschützen",1,0,0,1,"Aktiv-A G10m","","A","LizenzG10m","Herr","",0,1,"01.01.2023","","","",0,"1.44.0.00.045","Vaduz Zimmerschützen","","","","Aktiv","Newsletter Email","Abonnement","27.07.2023","","Nein","Nein","","","","","",1,"01.12.2023 14:27"]
["1251547","303475","Hanspeter","Meli","","","Gerbistr. 3","8887","Mels","CH","","","","+41793527824","hanspeter.meli@kks-mels.ch","www.kks-mels.ch","Männlich","23.05.1976","756.3319.9664.34","Deutsch","CH","1.44.0.00.027","Mels Kleinkaliberschützen",1,0,0,1,"Aktiv-A G50m","","A","LizenzG50m","Herr","",0,1,"18.03.2011","","","",0,"1.44.0.00.027","Mels Kleinkaliberschützen","","","","Aktiv","","Abonnement","27.07.2023","","Nein","","","","","","",1,"01.12.2023 14:27"]
["1869252","948543","Leandra","Pfiffner","","","Parfannastr. 41","8887","Mels","CH","","","","","leandra.pfiffner@kks-mels.ch","","Weiblich","09.04.2005","756.1342.0329.04","Deutsch","CH","1.44.0.00.027","Mels Kleinkaliberschützen",1,0,0,1,"Aktiv-A G50m","","A","LizenzG50m","Frau","",0,0,"02.05.2023","","","",0,"1.17.0.06.052","Mels Schützenverein","","","","Aktiv","","Abonnement","27.07.2023","","Nein","","","","","","",1,"01.12.2023 14:27"]
["1061174","113089","Roger","Bless","","","Zwergstr. 8","8890","Flums","CH","081 / 772 45 80","","081 599 19 75","076 540 81 41","roger.bless@gmx.ch","www.svquarten-oberterzen.ch","Männlich","13.10.1975","","Deutsch","CH","1.44.0.00.027","Mels Kleinkaliberschützen",1,0,0,1,"Aktiv-A G50m","","A","LizenzG50m","Herr","r.bless@vat.ch",0,0,"10.03.1995","","","",0,"1.17.0.06.064","Oberterzen SV Quarten-Oberterzen","","","","Aktiv","","Abonnement","27.07.2023","","Nein","","","","","","",1,"01.12.2023 14:27"]
["1061182","113097","Roland","Kurath","","","Reschustr. 16","8888","Heiligkreuz (Mels)","CH","","","081 723 62 45","079 606 47 83","r.kurath@bluewin.ch","","Männlich","19.06.1960","","Deutsch","CH","1.44.0.00.027","Mels Kleinkaliberschützen",1,0,0,1,"Aktiv-A G50m","","A","LizenzG50m","Herr","",0,1,"10.03.2000","","","",0,"1.44.0.00.027","Mels Kleinkaliberschützen","","","","Aktiv","Newsletter Email","Abonnement","27.07.2023","","Nein","Nein","","","","","",1,"01.12.2023 14:27"]
["1088528","140445","Silvio","Messmer","","","Schönenbüel  31","9050","Appenzell Steinegg","CH","","","071 780 14 07","079 328 09 20","silvio.messmer@inf-sv-ried.ch","","Männlich","15.10.1981","756.1714.0734.29","Deutsch","CH","1.44.0.00.050","Weissbad Sportschützen",1,0,0,1,"Aktiv-A G50m","","A","LizenzG50m","Herr","",0,1,"22.03.2007","","","",0,"1.16.0.00.003","Ried, Infanterieschützenverein Appenzell","","","","Aktiv","Newsletter Email","Abonnement","27.07.2023","","Nein","Nein","","","","","",1,"01.12.2023 14:27"]
["1205091","257017","René","Scherrer","","","Sonnental 4","9313","Muolen","CH","","","","","","","Männlich","20.01.1958","","Deutsch","CH","1.44.0.00.019","Hatswil Sportschützen",1,0,0,1,"Aktiv-A G50m","","A","LizenzG50m","Herr","",0,0,"09.05.2014","","","",0,"1.17.0.01.014","Waldkirch-Häggenschwil, Schützenverein Ramschwag","","","","Aktiv","","","","","","","","","","","","","01.12.2023 14:27"]
["1060866","112781","Erhard","Hüppi","","","Steinenbachstr. 22","9642","Ebnat-Kappel","CH","079 209 96 43","","071 993 29 07","079 209 96 43","erhard.hueppi@bluewin.ch","","Männlich","18.06.1954","","Deutsch","CH","1.44.0.00.011","Ebnat-Kappel & Umgebung Luftgewehrsektion",1,0,0,1,"Aktiv-A G10m Auflage","","A","LizenzG10m","Herr","erhard.hueppi@bluewin.ch",0,0,"01.01.2023","","","",0,"1.44.0.00.055","Dicken Ebnat-Kappel Sportschützen","","","","Aktiv","Newsletter Email","Abonnement","27.07.2023","","Nein","Nein","","","","","",1,"01.12.2023 14:27"]
["1796664","872167","Corina","Speck","","","Sonnenhalbstr. 59","9050","Appenzell","CH","","","","","speckcorina05@gmail.com","","Weiblich","06.05.2005","756.9610.7970.81","Deutsch","CH","1.44.0.00.050","Weissbad Sportschützen",1,0,0,1,"Aktiv-A G50m","","A","LizenzG50m","Frau","",0,0,"29.04.2022","","","",0,"1.16.0.00.001","Appenzell, Schützenverein","","","","Aktiv","Newsletter Email","","","","","Nein","","","","","","","01.12.2023 14:27"]
["1786926","861624","Ralf","Gmünder","","","Möserwies 21","9050","Appenzell Eggerst.","CH","","","","","","","Männlich","07.01.2005","756.0611.5102.04","Deutsch","CH","1.44.0.00.050","Weissbad Sportschützen",1,0,0,1,"Aktiv-A G50m","","A","LizenzG50m","Herr","",0,1,"09.07.2017","","","",0,"1.44.0.00.050","Weissbad Sportschützen","","","","Aktiv","Newsletter Email","","","","","Nein","","","","","","","01.12.2023 14:27"]
["1219488","271415","Florian","Steinmann","","","Wislistr. 12","9442","Berneck","CH","","","","","steini1992@bluewin.ch","","Männlich","21.08.1992","756.7389.4314.72","Deutsch","CH","1.44.0.00.031","Oberegg Luftgewehrsektion",1,0,0,1,"Aktiv-A G10m","","A","LizenzG10m","Herr","",0,1,"22.10.2007","","","",0,"1.16.0.00.017","Oberegg, Feldschützen","","","","Aktiv","Newsletter Email","Abonnement","27.07.2023","","Nein","Nein","","","","","",1,"01.12.2023 14:27"]
["1056260","108175","Jürg","Koller","","","Stoffelsweingarten 2","8592","Uttwil","CH","","","0714633477","","jkoller02@gmx.ch","","Männlich","03.05.1945","","Deutsch","CH","1.44.0.00.019","Hatswil Sportschützen",1,0,0,1,"Aktiv-A G50m","","A","LizenzG50m","Herr","",0,1,"10.03.2005","","","",0,"1.20.0.01.172","Uttwil Schützengesellschaft","","","","Aktiv","Newsletter Email","","","","","Nein","","","","","","","01.12.2023 14:27"]
["1822866","899889","Simon","Broger","","","Gehrenberg 24","9050","Appenzell","CH","","","","","albroger@bluewin.ch","","Männlich","18.06.2006","","Deutsch","CH","1.44.0.00.050","Weissbad Sportschützen",1,0,0,1,"Aktiv-A G50m","","A","LizenzG50m","Herr","",0,0,"28.05.2019","","","",0,"1.44.0.00.050","Weissbad Sportschützen","","","","Aktiv","","","","","","","","","","","","","01.12.2023 14:27"]
["1206481","258407","Kurt","Waldis","","","Kreuzlingerstr. 83","8590","Romanshorn","CH","","","079 888 75 20","079 888 75 20","kwaldis@kurtwaldis.ch","","Männlich","19.06.1986","","Deutsch","CH","1.44.0.00.019","Hatswil Sportschützen",1,0,0,1,"Aktiv-A G50m","","A","LizenzG50m","Herr","kwaldis@kurtwaldis.ch",0,1,"09.03.2017","","","",0,"1.20.0.01.172","Uttwil Schützengesellschaft","","","","Aktiv","Newsletter Email","Abonnement","27.07.2023","","Nein","Nein","","","","","",1,"01.12.2023 14:27"]
["1878938","958697","Zsombor","Lengyel","","","Leginglen 7","7320","Sargans","CH","","","","076 / 779 23 25","zolka23@yahoo.com","","Männlich","02.09.2006","","Deutsch","HU","1.44.0.00.033","Sargans Sportschützen",1,0,0,1,"Aktiv-A G10m","","A","LizenzG10m","Herr","",0,0,"15.10.2022","","","",0,"1.44.0.00.033","Sargans Sportschützen","","","","Aktiv","Newsletter Email","Abonnement","27.07.2023","","Nein","Nein","","","","","",1,"01.12.2023 14:27"]
["2219815","009244","Xhemail","Ahmeti","","2","Legglingen","7320","Sargans","CH","","","","0763239104","ahmetixhemail@gmail.com","","Männlich","28.01.2007","756.1833.3569.39","Deutsch","CH","1.44.0.00.033","Sargans Sportschützen",1,0,0,1,"Aktiv-A G10m","","A","LizenzG10m","","",0,0,"01.10.2023","","","",0,"1.44.0.00.033","Sargans Sportschützen","","","","Aktiv","Newsletter Email","Abonnement","01.10.2023","","Nein","Nein","","","","","",1,"01.12.2023 14:27"]
["2219815","009244","Xhemail","Ahmeti","","2","Legglingen","7320","Sargans","CH","","","","0763239104","ahmetixhemail@gmail.com","","Männlich","28.01.2007","756.1833.3569.39","Deutsch","CH","1.44.0.00.033","Sargans Sportschützen",1,0,0,1,"Aktiv-A G50m","","A","LizenzG50m","","",0,0,"01.10.2023","","","",0,"1.44.0.00.033","Sargans Sportschützen","","","","Aktiv","Newsletter Email","Abonnement","01.10.2023","","Nein","Nein","","","","","",1,"01.12.2023 14:27"]
["1077390","129306","Erhard","Bieri","","","Töbeliweg 4","7320","Sargans","CH","","","081 723 72 14","077 431 47 75","cher.bieri@bluewin.ch","","Männlich","04.06.1945","","Deutsch","CH","1.44.0.00.033","Sargans Sportschützen",1,0,0,1,"Aktiv-A G50m","","A","LizenzG50m","Herr","",0,1,"09.01.1969","","","",0,"1.44.0.00.033","Sargans Sportschützen","","","","Aktiv","Newsletter Email","Abonnement","27.07.2023","","Nein","Nein","","","","","",1,"01.12.2023 14:27"]
["1815462","892154","Philipp","Pfützner","","","Madrusstr. 5\t","7317","Valens","CH","","","","076 783 95 17","nicojany@gmx.de","","Männlich","13.07.2006","","Deutsch","CH","1.44.0.00.033","Sargans Sportschützen",1,0,0,1,"Aktiv-A G50m","","A","LizenzG50m","Herr","",0,0,"14.12.2019","","","",0,"1.44.0.00.033","Sargans Sportschützen","","","","Aktiv","","","","","","","","","","","","","01.12.2023 14:27"]
["1205331","257257","Reto","Frey","","","Vilterserstr. 20","7323","Wangs","CH","","","081 723 04 36","079 651 04 99","freyalpiger@hispeed.ch","","Männlich","20.02.1971","","Deutsch","CH","1.44.0.00.033","Sargans Sportschützen",1,0,0,1,"Aktiv-A G50m","","A","LizenzG50m","Herr","",0,1,"30.03.2016","","","",0,"1.17.0.06.108","Wangs Militärschützenverein","","","","Aktiv","Newsletter Email","Abonnement","27.07.2023","","Nein","Nein","","","","","",1,"01.12.2023 14:27"]
["1073630","125546","Marcel","Udech","","","Stuchisweg 2","7323","Wangs","CH","079 370 37 83","","032 511 34 02","","marcel@ude.ch","www.ude.ch","Männlich","12.11.1970","","Deutsch","CH","1.44.0.00.033","Sargans Sportschützen",1,0,0,1,"Aktiv-A G10m","","A","LizenzG10m","Herr","",0,0,"18.10.2017","","","",0,"1.44.0.00.033","Sargans Sportschützen","","","","Aktiv","Newsletter Email","Abonnement","27.07.2023","","Nein","Nein","","","","","",1,"01.12.2023 14:27"]
["1061265","113180","Stefan","Jäger","","","Rosengasse 17","7324","Vilters","CH","","","","079 747 78 75","jaeger.s@bluewin.ch","","Männlich","05.06.1986","756.8389.5399.39","Deutsch","CH","1.44.0.00.033","Sargans Sportschützen",1,0,0,1,"Aktiv-A G50m","","A","LizenzG50m","Herr","",0,1,"01.01.2023","","","",0,"1.44.0.00.033","Sargans Sportschützen","","","","Aktiv","Newsletter Email","Abonnement","27.07.2023","","Nein","Nein","","","","","",1,"01.12.2023 14:27"]
["1027059","003679","Joel","Golchert","","","Annabergstr. 9","8882","Unterterzen","CH","","","","+41 79 441 51 68","herbert.schmidli@ruag.ch","","Männlich","27.12.2007","","Deutsch","CH","1.44.0.00.033","Sargans Sportschützen",0,0,0,1,"Aktiv-A G50m","","A","LizenzG50m","Herr","",0,0,"01.01.2023","","","",0,"1.44.0.00.033","Sargans Sportschützen","","","","Aktiv","","","","","","","","","04.09.2023","","","","01.12.2023 14:27"]
["1061233","113148","Paul","Hochreutener","Mitglied SK AI","","Unterdorfstr. 12 A","9413","Oberegg","CH","","","071 891 22 37","0775224148","phochreutener@gmx.ch","","Männlich","19.07.1956","756.3729.5962.52","Deutsch","CH","1.44.0.00.031","Oberegg Luftgewehrsektion",1,0,0,1,"Aktiv-A G10m Auflage","","A","LizenzG10m","Herr","",0,1,"01.01.1987","","","",0,"1.16.0.00.017","Oberegg, Feldschützen","","","","Aktiv","Newsletter Email","Abonnement","27.07.2023","","Nein","Nein","","","","","",1,"01.12.2023 14:27"]
["1723008","793383","Adrian","Rusch","","","Bäbelers 18","9050","Appenzell Steinegg","CH","","","","078 669 00 65","gmock@bluewin.ch","","Männlich","10.10.2001","756.2930.6668.91","Deutsch","CH","1.44.0.00.050","Weissbad Sportschützen",1,0,0,1,"Aktiv-A G50m","","A","LizenzG50m","Herr","",0,0,"24.04.2019","","","",0,"1.16.0.00.001","Appenzell, Schützenverein","","","","Aktiv","","","","","","","","","","","","","01.12.2023 14:27"]
["1061232","113147","Viktor","Eugster","","","Rüteggstr. 12","9413","Oberegg","CH","","","071 891 30 17","","viktor.eugster@bluewin.ch","","Männlich","29.06.1964","","Deutsch","CH","1.44.0.00.031","Oberegg Luftgewehrsektion",1,0,0,1,"Aktiv-A G10m","","A","LizenzG10m","Herr","",0,0,"01.01.1987","","","",0,"1.44.0.00.031","Oberegg Luftgewehrsektion","","","","Aktiv","Newsletter Email","Abonnement","27.07.2023","","Nein","Nein","","","","","",1,"01.12.2023 14:27"]
["1050504","102418","Josef","Vollenweider","","","Hamisfeld 19","8580","Hefenhofen","CH","","","","","josef.vollenweider@bluewin.ch","www.sgseon.ch","Männlich","30.07.1955","","Deutsch","CH","1.44.0.00.019","Hatswil Sportschützen",1,0,0,1,"Aktiv-A G50m","","A","LizenzG50m","Herr","",0,1,"06.03.2008","","","",0,"1.20.0.01.040","Hefenhofen-Dozwil Schützengesellschaft","","","","Aktiv","Newsletter Email","Abonnement","27.07.2023","","Nein","Nein","","","","","",1,"01.12.2023 14:27"]
["1061047","112962","Heinz","Schmidhauser","","","Sonnmattstr. 5B","8590","Romanshorn","CH","","","071 463 61 25","079 238 40 10","","","Männlich","25.03.1949","","Deutsch","CH","1.44.0.00.019","Hatswil Sportschützen",1,0,0,1,"Aktiv-A G50m","","A","LizenzG50m","Herr","",0,1,"17.03.2018","","","",0,"1.44.0.00.019","Hatswil Sportschützen","","","","Aktiv","","Abonnement","27.07.2023","","Nein","","","","","","",1,"01.12.2023 14:27"]
["1060700","112615","René","Streule","","","Lauftenstr. 4","9050","Appenzell","CH","","","071 787 53 91","079 283 97 44","rene.streule@bluewin.ch","","Männlich","05.03.1957","756.4098.0931.13","Deutsch","CH","1.44.0.00.050","Weissbad Sportschützen",1,0,0,1,"Aktiv-A G50m","","A","LizenzG50m","Herr","",0,0,"01.01.2023","","","",0,"1.16.0.00.006","Clanx, Schützengesellschaft Appenzell","","","","Aktiv","Newsletter Email","Abonnement","27.07.2023","","Nein","Nein","","","","","",1,"01.12.2023 14:27"]
["1859645","938405","Rudolf","Benz","","","Martina-Hälg-Str. 19","8590","Romanshorn","CH","","","+41717800605","+41791922390","rudolf.benz@bluewin.ch","","Männlich","11.10.1952","756.2723.8458.92","Deutsch","CH","1.44.0.00.019","Hatswil Sportschützen",1,0,0,1,"Aktiv-A G50m Auflage","","A","LizenzG50mAuflage","Herr","",0,1,"01.06.2022","","","",0,"1.20.0.01.010","Amriswil Schützengesellschaft","","","","Aktiv","Newsletter Email","Abonnement","27.07.2023","","Nein","Nein","","","","","",1,"01.12.2023 14:27"]
["1220887","272814","Heinz","Bösch","","","Wisli 265","9655","Stein SG","CH","","","","079 343 81 45","thboesch@bluewin.ch","","Männlich","25.04.1956","","Deutsch","CH","1.44.0.00.011","Ebnat-Kappel & Umgebung Luftgewehrsektion",1,0,0,1,"Aktiv-A G10m Auflage","","A","LizenzG10m","Herr","",0,0,"01.01.2023","","","",0,"1.17.0.09.089","Stein SG Schützenverein","","","","Aktiv","Newsletter Email","Abonnement","27.07.2023","","Nein","Nein","","","","","",1,"01.12.2023 14:27"]
["1409702","461638","Deborah","Sprenger","","","Wiesstr. 2d","9413","Oberegg","CH","","","","","deby.kalberer@hotmail.com","","Weiblich","10.03.1992","","Deutsch","CH","1.44.0.00.027","Mels Kleinkaliberschützen",0,0,0,1,"Aktiv-A G50m","","A","LizenzG50m","Frau","",0,0,"08.03.2019","","","",0,"1.17.0.06.052","Mels Schützenverein","","","","Aktiv","","Abonnement","27.07.2023","31.07.2023","Nein","","","","16.03.2020","","",1,"01.12.2023 14:27"]
["2196287","002162","Til","Guggisberg","","","untere Mätzwiesenstrasse 2","8897","Flumserberg Tannenheim","CH","","","","","til.guggisberg@kks-mels.ch","","Männlich","05.04.2008","","Deutsch","CH","1.44.0.00.027","Mels Kleinkaliberschützen",1,0,0,1,"Aktiv-A G50m","","A","LizenzG50m","Herr","",0,0,"02.05.2023","","","",0,"1.44.0.00.027","Mels Kleinkaliberschützen","","","","Aktiv","Newsletter Email","Abonnement","02.05.2023","","Nein","Nein","","","","","",1,"01.12.2023 14:27"]
["1152120","204043","Manuel","Pfiffner","","","Zeughausstr. 3","8887","Mels","CH","","","081 723 62 22","079 633 39 95","manuel.pfiffner@gmail.com","","Männlich","06.08.1987","","Deutsch","CH","1.44.0.00.027","Mels Kleinkaliberschützen",1,0,0,1,"Aktiv-A G50m","","A","LizenzG50m","Herr","",0,0,"04.03.2022","","","",0,"1.17.0.06.079","Sargans Schützenverein","","","","Aktiv","","Abonnement","27.07.2023","","Nein","","","","31.12.2023","","",1,"01.12.2023 14:27"]
["1061609","113524","Martin","Elkuch","","","Oberbühl 96","9487","Gamprin-Bendern","LI","","","+42 3373 2471","","sportwart@ssem.li","","Männlich","15.10.1958","","Deutsch","LI","1.44.0.00.058","Eschen Sportschützen",1,0,0,1,"Aktiv-A G10m Auflage","","A","LizenzG10m","Herr","martin.elkuch@adon.li",0,1,"01.01.2023","","","",0,"1.44.0.00.058","Eschen Sportschützen","","","","Aktiv","Newsletter Email","Abonnement","27.07.2023","","Nein","Nein","","","","","",1,"01.12.2023 14:27"]
["1216506","268433","Stephan","Hoop","","","Birkenweg 49","9498","Planken","LI","","","","","hoop_stephan@hotmail.com","","Männlich","11.10.1989","","Deutsch","LI","1.44.0.00.058","Eschen Sportschützen",1,0,0,1,"Aktiv-A G10m","","A","LizenzG10m","Herr","",0,1,"01.01.2023","","","",0,"1.44.0.00.058","Eschen Sportschützen","","","","Aktiv","Newsletter Email","Abonnement","27.07.2023","","Nein","Nein","","","","","",1,"01.12.2023 14:27"]
["1909579","990515","Talitha","Weitbrecht","","","Städtchenstr. 78","7320","Sargans","CH","","","","","","","Weiblich","14.08.2009","","Deutsch","CH","1.44.0.00.045","Vaduz Zimmerschützen",1,0,0,1,"Aktiv-B G10m","","B","LizenzG10m","Frau","",0,0,"30.09.2023","","","",0,"1.44.0.00.033","Sargans Sportschützen","","","","Aktiv","Newsletter Email","Abonnement","27.07.2023","","Nein","Nein","","","","","",1,"01.12.2023 14:27"]
["1170180","222105","Stefano","Keller","","","Weidstrasse 15","7323","Wangs","CH","","","","079 291 05 25","stefanokeller@hispeed.ch","","Männlich","27.09.1973","","Deutsch","CH","1.44.0.00.027","Mels Kleinkaliberschützen",1,0,0,1,"Aktiv-A G50m","","A","LizenzG50m","Herr","",0,0,"04.03.2022","","","",0,"1.17.0.06.065","Pfäfers Schützengesellschaft Taminaschützen","","","","Aktiv","","Abonnement","27.07.2023","","Nein","","","","","","",1,"01.12.2023 14:27"]
["1061176","113091","Roger","Eberle","","","Rennweg 20","8888","Heiligkreuz (Mels)","CH","","","081 723 00 43","079 504 84 32","roger.eberle@kks-mels.ch","www.kks-mels.ch","Männlich","25.09.1976","","Deutsch","CH","1.44.0.00.027","Mels Kleinkaliberschützen",1,0,0,1,"Aktiv-A G50m","","A","LizenzG50m","Herr","",0,1,"10.03.1996","","","",0,"1.44.0.00.027","Mels Kleinkaliberschützen","","","","Aktiv","","Abonnement","27.07.2023","","Nein","","","","","","",1,"01.12.2023 14:27"]
["2196277","002131","Ursina","Müller","","","Marchrietstrasse 2","8888","Heiligkreuz (Mels)","CH","","","","","ursina.müller@kks-mels.ch","","Weiblich","15.10.2009","","Deutsch","CH","1.44.0.00.027","Mels Kleinkaliberschützen",1,0,0,1,"Aktiv-A G50m","","A","LizenzG50m","","",0,0,"02.05.2023","","","",0,"1.44.0.00.027","Mels Kleinkaliberschützen","","","","Aktiv","Newsletter Email","Abonnement","02.05.2023","","Nein","Nein","","","","","",1,"01.12.2023 14:27"]
["2207680","005491","Noel","Manser","","","","9057","Weissbad","CH","","","","","","","Männlich","09.03.2011","756.4621.3106.87","","CH","1.44.0.00.050","Weissbad Sportschützen",1,0,0,1,"Aktiv-A G50m","","A","LizenzG50m","Herr","",0,0,"11.09.2023","","","",0,"1.44.0.00.050","Weissbad Sportschützen","","","","Aktiv","Newsletter Email","","","","","Nein","","","","","","","01.12.2023 14:27"]
["1060687","112602","Christian","Manser","","","Bilchenstr. 17","9050","Eggerstanden","CH","","","071 787 27 90","078 818 04 01","chr.manser@bluewin.ch","","Männlich","30.11.1983","756.1379.7809.60","Deutsch","CH","1.44.0.00.050","Weissbad Sportschützen",1,0,0,1,"Aktiv-A G50m","","A","LizenzG50m","Herr","",0,1,"14.06.2020","","","",0,"1.16.0.00.002","Eggerstanden, Schützenverein","","","","Aktiv","Newsletter Email","Abonnement","27.07.2023","","Nein","Nein","","","","","",1,"01.12.2023 14:27"]
["1065159","117074","Christian","Marolf","","","Lothalde 25","8595","Altnau","CH","079 741 02 77","","071 695 13 42","079 741 02 77","ch.ma@bluewin.ch","","Männlich","11.04.1989","756.9327.5374.75","Deutsch","CH","1.44.0.00.019","Hatswil Sportschützen",1,0,0,1,"Aktiv-A G50m","","A","LizenzG50m","Herr","c.marolf@mc-solutions.ch",0,1,"05.03.2020","","","",0,"1.20.0.05.007","Altnau-Langrickenbach Schützen","","","","Aktiv","","","","","","","","","","","","","01.12.2023 14:27"]
["1060774","112689","Marcel","Schilliger","","","Städeliweg 5","9220","Bischofszell","CH","","","071 422 43 13","078 646 77 82","mschilliger@bluewin.ch","","Männlich","26.06.1981","756.9933.3369.43","Deutsch","CH","1.44.0.00.011","Ebnat-Kappel & Umgebung Luftgewehrsektion",1,0,0,1,"Aktiv-B G10m","","B","LizenzG10m","Herr","praesident@ospsv.ch",0,1,"06.10.2012","","","",0,"1.44.0.00.007","Bischofszell Sportschützen","","","","Aktiv","Newsletter Email","Abonnement","27.07.2023","","Nein","Nein","","","","","",1,"01.12.2023 14:27"]
["1060685","112600","Emil","Koster","","","Lehnstr. 137","9050","Appenzell Meistersrüte","CH","","","071 787 39 54","079 688 51 01","emil.koster@bluewin.ch","","Männlich","06.03.1959","756.8772.6760.50","Deutsch","CH","1.44.0.00.050","Weissbad Sportschützen",1,0,0,1,"Aktiv-A G50m","","A","LizenzG50m","Herr","",0,0,"01.01.2023","","","",0,"1.16.0.00.006","Clanx, Schützengesellschaft Appenzell","","","","Aktiv","Newsletter Email","","","","","Nein","","","","","","","01.12.2023 14:27"]
["1060870","112785","Hanspeter","Künzli","","","Howartstr. 33","9642","Ebnat-Kappel","CH","","","071 993 29 16","079 815 69 60","hanspeterkuenzli@thurweb.ch","","Männlich","06.04.1967","756.3605.1740.17","Deutsch","CH","1.44.0.00.011","Ebnat-Kappel & Umgebung Luftgewehrsektion",1,0,0,1,"Aktiv-A G10m","","A","LizenzG10m","Herr","",0,0,"01.01.2023","","","",0,"1.44.0.00.055","Dicken Ebnat-Kappel Sportschützen","","","","Aktiv","","Abonnement","27.07.2023","","Nein","","","","","","",1,"01.12.2023 14:27"]
["1080942","132858","Andreas","Künzli","","","Fittligen 203","9643","Krummenau","CH","","","071 994 14 67","079 567 23 73","res.kuenzli@bluewin.ch","","Männlich","03.09.1962","756.4413.2019.57","Deutsch","CH","1.44.0.00.011","Ebnat-Kappel & Umgebung Luftgewehrsektion",0,0,0,1,"Aktiv-A G10m","","A","LizenzG10m","Herr","",0,1,"01.01.2023","","","",0,"1.17.0.09.050","Krummenau Schützengesellschaft Wilhelm Tell","","","","Aktiv","Newsletter Email","Abonnement","27.07.2023","","Nein","Nein","","","29.09.2023","","",1,"01.12.2023 14:27"]
["1758222","830925","Jan","Ulmann","","","Gaiserstrasse 196","9050","Appenzell Meistersrüte","CH","","","071 787 56 04","079 791 79 99","jan.ulmann03@gmail.com","","Männlich","19.10.2003","756.9707.5826.99","Deutsch","CH","1.44.0.00.050","Weissbad Sportschützen",1,0,0,1,"Aktiv-A G50m","","A","LizenzG50m","Herr","",0,0,"14.06.2020","","","",0,"1.16.0.00.006","Clanx, Schützengesellschaft Appenzell","","","","Aktiv","Newsletter Email","Abonnement","27.07.2023","","Nein","Nein","","","","","",1,"01.12.2023 14:27"]
["1242352","294279","Andreas","Seitz","","","Hauptstr. 132","9434","Au","CH","","","","079 812 60 59","seitz-andreas@gmx.ch","","Männlich","07.02.1992","756.5405.1702.51","Deutsch","CH","1.44.0.00.031","Oberegg Luftgewehrsektion",1,0,0,1,"Aktiv-A G10m","","A","LizenzG10m","Herr","",0,0,"22.10.2007","","","",0,"1.44.0.00.031","Oberegg Luftgewehrsektion","","","","Aktiv","Newsletter Email","Abonnement","27.07.2023","","Nein","Nein","","","","","",1,"01.12.2023 14:27"]
["1061231","113146","Adrian","Eugster","","","Vorderladeren 7","9413","Oberegg","CH","","","071 891 28 58","","adrian.eugster@bluewin.ch","","Männlich","04.02.1967","756.2886.2316.55","Deutsch","CH","1.44.0.00.031","Oberegg Luftgewehrsektion",1,0,0,1,"Aktiv-A G10m","","A","LizenzG10m","Herr","",0,0,"01.01.1987","","","",0,"1.16.0.00.017","Oberegg, Feldschützen","","","","Aktiv","Newsletter Email","Abonnement","27.07.2023","","Nein","Nein","","","","","",1,"01.12.2023 14:27"]
["1720612","790659","Lorena","Vanoni","","","Palduinstr. 26","9496","Balzers","LI","","","","","","","Weiblich","25.09.2002","","Deutsch","LI","1.44.0.00.045","Vaduz Zimmerschützen",1,0,0,1,"Aktiv-A G10m","","A","LizenzG10m","Frau","",0,1,"01.01.2023","","","",0,"1.44.0.00.045","Vaduz Zimmerschützen","","","","Aktiv","Newsletter Email","","","","","Nein","","","","","","","01.12.2023 14:27"]
["1734232","805300","Felix","Stricker","","","Rosenstr. 14","9493","Mauren FL","LI","","","","","","","Männlich","08.08.2004","","Deutsch","LI","1.44.0.00.058","Eschen Sportschützen",1,0,0,1,"Aktiv-A G10m","","A","LizenzG10m","Herr","",0,1,"22.09.2015","","","",0,"1.44.0.00.058","Eschen Sportschützen","","","","Aktiv","Newsletter Email","Abonnement","27.07.2023","","Nein","Nein","","","","","",1,"01.12.2023 14:27"]
["1026047","002654","Joana","Paes Costa","","","Essanenstr. 166","9492","Eschen","LI","","","","","","","Weiblich","08.10.2006","","Deutsch","CH","1.44.0.00.058","Eschen Sportschützen",1,0,0,1,"Aktiv-A G10m","","A","LizenzG10m","Frau","",0,1,"01.01.2020","","","",0,"1.17.0.05.016","Buchs-Räfis Schützengesellschaft","","","","Aktiv","","","","","","","","","","","","","01.12.2023 14:27"]
["1078803","130719","Patrick","Meli","","","Grenzweg 6","8888","Heiligkreuz (Mels)","CH","","","081 723 86 32","078 803 86 96","patrick.meli@oerlikon.com","www.kks-mels.ch","Männlich","26.11.1971","","Deutsch","CH","1.44.0.00.027","Mels Kleinkaliberschützen",1,0,0,1,"Aktiv-A G50m","","A","LizenzG50m","Herr","",0,1,"12.03.2002","","","",0,"1.17.0.06.052","Mels Schützenverein","","","","Aktiv","Newsletter Email","Abonnement","27.07.2023","","Nein","Nein","","","","","",1,"01.12.2023 14:27"]
["1152634","204557","Marc-André","Kessler","","","Oberbendern 16","9487","Gamprin-Bedern","CH","","","","","mc.kessler@hotmail.com","","Männlich","14.09.1984","","Deutsch","CH","1.44.0.00.045","Vaduz Zimmerschützen",1,0,0,1,"Aktiv-A G10m","","A","LizenzG10m","Herr","",0,1,"12.04.2011","","","",0,"1.44.0.00.045","Vaduz Zimmerschützen","","","","Aktiv","Newsletter Email","","","","","Nein","","","","","","","01.12.2023 14:27"]
["1061412","113327","Oliver","Geissmann","","","Rüfestr. 7","9490","Vaduz","LI","","","","078 667 80 68","oliver.geissmann@adon.li","","Männlich","09.12.1978","","Deutsch","CH","1.44.0.00.045","Vaduz Zimmerschützen",1,0,0,1,"Aktiv-A G10m","","A","LizenzG10m","Herr","",0,0,"01.10.2015","","","",0,"1.44.0.00.045","Vaduz Zimmerschützen","","","","Aktiv","Newsletter Email","","","","","Nein","","","","","","","01.12.2023 14:27"]
["1078850","130766","Thomas","Pfiffner","","","Optikweg 7","8887","Mels","CH","","","081 723 20 85","079 221 34 50","thomas.pfiffner@swisscom.com","","Männlich","25.05.1974","756.3092.4272.07","Deutsch","CH","1.44.0.00.027","Mels Kleinkaliberschützen",1,0,0,1,"Aktiv-A G50m","","A","LizenzG50m","Herr","",0,1,"12.03.2014","","","",0,"1.17.0.06.052","Mels Schützenverein","","","","Aktiv","Newsletter Email","Abonnement","27.07.2023","","Nein","Nein","","","","","",1,"01.12.2023 14:27"]
["1651018","715754","Andrea","Willi","","","Tilserstr. 40","8889","Plons","CH","","","","","","","Weiblich","03.08.1983","","Deutsch","CH","1.44.0.00.027","Mels Kleinkaliberschützen",0,0,0,1,"Aktiv-A G50m","","A","LizenzG50m","Frau","",0,0,"18.03.2013","","","",0,"1.44.0.00.027","Mels Kleinkaliberschützen","","","","Aktiv","","","","","","","","","01.01.2017","","","","01.12.2023 14:27"]
["1909579","990515","Talitha","Weitbrecht","","","Städtchenstr. 78","7320","Sargans","CH","","","","","","","Weiblich","14.08.2009","","Deutsch","CH","1.44.0.00.033","Sargans Sportschützen",1,0,0,1,"Aktiv-A G50m","","A","LizenzG50m","Frau","",0,0,"01.01.2023","","","",0,"1.44.0.00.033","Sargans Sportschützen","","","","Aktiv","Newsletter Email","Abonnement","27.07.2023","","Nein","Nein","","","","","",1,"01.12.2023 14:27"]
["1779879","853941","Niclas","Kressel","","","Unterdorfstr. 9","8892","Berschis","CH","","","","079 346 77 69","yvonne.kressel@gmail.com","","Männlich","10.01.2006","","Deutsch","DE","1.44.0.00.033","Sargans Sportschützen",0,0,0,1,"Aktiv-A G50m","","A","LizenzG50m","Herr","",0,0,"12.11.2016","","","",0,"1.17.0.06.013","Berschis Feldschützengesellschaft","","","","Aktiv","","","","","","","","","04.09.2023","","","","01.12.2023 14:27"]
["1779879","853941","Niclas","Kressel","","","Unterdorfstr. 9","8892","Berschis","CH","","","","079 346 77 69","yvonne.kressel@gmail.com","","Männlich","10.01.2006","","Deutsch","DE","1.44.0.00.033","Sargans Sportschützen",0,0,0,1,"Aktiv-A G10m","","A","LizenzG10m","Herr","",0,0,"22.10.2021","","","",0,"1.17.0.06.013","Berschis Feldschützengesellschaft","","","","Aktiv","","","","","","","","","04.09.2023","","","","01.12.2023 14:27"]
["1059892","111807","Daniel","Siegenthaler","","","Gulerstr. 22b","7320","Sargans","CH","","","+41 81 723 76","078 231 00 71","daniel@siegenthaler.cc","","Männlich","28.10.1961","756.1202.9736.75","Deutsch","CH","1.44.0.00.033","Sargans Sportschützen",1,0,0,1,"Aktiv-A G50m","","A","LizenzG50m","Herr","daniel.siegenthler@swissshooting.ch",0,1,"21.03.1995","","","",0,"1.17.0.06.079","Sargans Schützenverein","","","","Aktiv","Newsletter Email","Gratisabo Ehrenmitglied SSV","03.02.2014","","Nein","Nein","","","","","",1,"01.12.2023 14:27"]
["1059892","111807","Daniel","Siegenthaler","","","Gulerstr. 22b","7320","Sargans","CH","","","+41 81 723 76","078 231 00 71","daniel@siegenthaler.cc","","Männlich","28.10.1961","756.1202.9736.75","Deutsch","CH","1.44.0.00.033","Sargans Sportschützen",1,0,0,1,"Aktiv-A G10m Auflage","","A","LizenzG10m","Herr","daniel.siegenthler@swissshooting.ch",0,1,"01.01.2023","","","",0,"1.17.0.06.079","Sargans Schützenverein","","","","Aktiv","Newsletter Email","Gratisabo Ehrenmitglied SSV","03.02.2014","","Nein","Nein","","","","","",1,"01.12.2023 14:27"]
["1251930","303858","Michael","Mendler","","","St.Gallerstr. 124","9032","Engelburg","CH","","","","","m.mendler@bluewin.ch","","Männlich","31.12.1986","756.1998.8074.51","Deutsch","CH","1.44.0.00.012","Egnach Sportschützen",1,0,0,1,"Aktiv-A G50m","","A","LizenzG50m","Herr","",0,1,"01.01.2023","","","",0,"1.44.0.00.012","Egnach Sportschützen","","","","Aktiv","Newsletter Email","Abonnement","27.07.2023","","Nein","Nein","","","","","",1,"01.12.2023 14:27"]
["1061526","113441","Bruno","Forrer","","","Vordere Schwendistr. 12","9658","Wildhaus","CH","","","","","b.forrer@bluewin.ch","","Männlich","11.11.1981","","Deutsch","CH","1.44.0.00.052","Wildhaus Sportschützen",1,0,0,1,"Aktiv-A G50m","","A","LizenzG50m","Herr","",0,1,"01.01.2023","","","",0,"1.44.0.00.052","Wildhaus Sportschützen","","","","Aktiv","Newsletter Email","Abonnement","27.07.2023","","Nein","Nein","","","","","",1,"01.12.2023 14:27"]
["1025024","001625","Jan","Moser","","","Oberdorf 1924","9643","Krummenau","CH","","","","","","","Männlich","10.12.2007","","Deutsch","CH","1.44.0.00.052","Wildhaus Sportschützen",1,0,0,1,"Aktiv-A G50m","","A","LizenzG50m","Herr","",0,0,"27.03.2021","","","",0,"1.44.0.00.052","Wildhaus Sportschützen","","","","Aktiv","Newsletter Email","Abonnement","27.07.2023","","Nein","Nein","","","","","",1,"01.12.2023 14:27"]
["1678209","745001","Sandra","Krannich","","","Kollersweidstr. 1","9658","Wildhaus","CH","","","","","sandrakrannich2405@gmail.com","","Weiblich","24.05.2000","","Deutsch","DE","1.44.0.00.052","Wildhaus Sportschützen",1,0,0,1,"Aktiv-A G50m","","A","LizenzG50m","Frau","",0,0,"17.03.2014","","","",0,"1.44.0.00.052","Wildhaus Sportschützen","","","","Aktiv","Newsletter Email","Abonnement","27.07.2023","","Nein","Nein","","","","","",1,"01.12.2023 14:27"]
["1061284","113199","Remo","Zimmermann","","","Feldweg 2","7324","Vilters","CH","","","081 723 30 61","076 310 44 41\t\t","removilters@gmail.com","","Männlich","01.09.1972","756.7006.5993.87","Deutsch","CH","1.44.0.00.033","Sargans Sportschützen",1,0,0,1,"Aktiv-A G50m","","A","LizenzG50m","Herr","",0,0,"21.03.1997","","","",0,"1.17.0.06.101","Vilters Militärschützenverein","","","","Aktiv","Newsletter Email","Abonnement","27.07.2023","","Nein","Nein","","","","","",1,"01.12.2023 14:27"]
["1061178","113093","Herbert","Frey","","","Kauenstr. 5","8887","Mels","CH","","","081 723 50 38","079 759 16 55","","","Männlich","17.04.1947","","Deutsch","CH","1.44.0.00.033","Sargans Sportschützen",0,0,0,1,"Aktiv-A G50m","","A","LizenzG50m","Herr","",1,0,"28.01.2011","","","",0,"1.44.0.00.033","Sargans Sportschützen","","","","Aktiv","","","","","","","","","15.10.2023","","","","01.12.2023 14:27"]
["1084169","136086","Peter","Benz","","","Wiesenstr. 4","9463","Oberriet SG","CH","","","071 761 25 88","079 738 62 38\t\t","pe.benz@bluewin.ch","","Männlich","15.04.1965","","Deutsch","CH","1.44.0.00.033","Sargans Sportschützen",1,0,0,1,"Aktiv-A G50m","","A","LizenzG50m","Herr","",0,0,"01.01.2023","","","",0,"1.05.0.02.028","Galgenen Infanterieschiessverein","","","","Aktiv","Newsletter Email","Abonnement","27.07.2023","","Nein","Nein","","","","","",1,"01.12.2023 14:27"]
["1061270","113185","Martin","Nauer","","","Furggelsstr. 20","7313","St. Margrethenberg","CH","","","081 302 15 46","079 380 84 22","martin.nauer@rsnweb.ch","","Männlich","22.04.1942","756.9071.6130.43","Deutsch","CH","1.44.0.00.033","Sargans Sportschützen",1,0,0,1,"Aktiv-A G50m","","A","LizenzG50m","Herr","",0,1,"09.01.1969","","","",0,"1.17.0.06.052","Mels Schützenverein","","","","Aktiv","Newsletter Email","Abonnement","27.07.2023","","Nein","Nein","","","","","",1,"01.12.2023 14:27"]
["1061276","113191","Ruth","Siegenthaler","","","Gulerstr. 22B","7320","Sargans","CH","081 723 76 62","","","079 272 41 07","ruth@siegenthaler.cc","","Weiblich","22.02.1961","","Deutsch","CH","1.44.0.00.033","Sargans Sportschützen",1,0,0,1,"Aktiv-A G10m","","A","LizenzG10m","Frau","",0,1,"03.12.1995","","","",0,"1.44.0.00.033","Sargans Sportschützen","","","","Aktiv","Newsletter Email","","","","","Nein","","","","","","","01.12.2023 14:27"]
["1061276","113191","Ruth","Siegenthaler","","","Gulerstr. 22B","7320","Sargans","CH","081 723 76 62","","","079 272 41 07","ruth@siegenthaler.cc","","Weiblich","22.02.1961","","Deutsch","CH","1.44.0.00.033","Sargans Sportschützen",1,0,0,1,"Aktiv-A G50m","","A","LizenzG50m","Frau","",0,1,"21.03.1994","","","",0,"1.44.0.00.033","Sargans Sportschützen","","","","Aktiv","Newsletter Email","","","","","Nein","","","","","","","01.12.2023 14:27"]
["1061524","113439","Claudia","Brauchli","","","Untere Riethaldenstr. 6","9658","Wildhaus","CH","","","071 999 28 17","","cl-brauchli@outlook.com","","Weiblich","21.01.1975","","Deutsch","CH","1.44.0.00.052","Wildhaus Sportschützen",1,0,0,1,"Aktiv-A G50m","","A","LizenzG50m","Frau","",0,1,"01.01.2023","","","",0,"1.44.0.00.052","Wildhaus Sportschützen","","","","Aktiv","","","","","","","","","","","","","01.12.2023 14:27"]
["1888928","969087","Matteo","Schneider","","","Bahnweg 1","7324","Vilters","CH","","","","079 422 07 22","msb77@ilnet.ch","","Männlich","31.08.2010","","Deutsch","CH","1.44.0.00.033","Sargans Sportschützen",0,0,0,1,"Aktiv-A G50m","","A","LizenzG50m","Herr","",0,0,"14.12.2019","","","",0,"1.44.0.00.033","Sargans Sportschützen","","","","Aktiv","","","","","","","","","04.09.2023","","","","01.12.2023 14:27"]
["1061529","113444","Armin","Kaufmann","","","Hauptstr. 43","8546","Islikon","CH","","","052 233 37 00","","hiprewacut@bluewin.ch","","Männlich","17.07.1954","","Deutsch","CH","1.44.0.00.052","Wildhaus Sportschützen",1,0,0,1,"Aktiv-A G50m","","A","LizenzG50m","Herr","",0,1,"01.01.2023","","","",0,"1.44.0.00.052","Wildhaus Sportschützen","","","","Aktiv","Newsletter Email","Abonnement","27.07.2023","","Nein","Nein","","","","","",1,"01.12.2023 14:27"]
["1715257","784623","Selin","Brauchli","","","Dorfstrasse 9","9656","Alt St. Johann","CH","","","","0767002817","selin02brauchli@outlook.com","","Weiblich","06.05.2002","","Deutsch","CH","1.44.0.00.052","Wildhaus Sportschützen",1,0,0,1,"Aktiv-A G50m","","A","LizenzG50m","Frau","",0,0,"20.03.2015","","","",0,"1.44.0.00.052","Wildhaus Sportschützen","","","","Aktiv","Newsletter Email","","","","","Nein","","","","","","","01.12.2023 14:27"]
["1027060","003680","Phillip","Wachsmann","","","Bidenstr. 35","7310","Bad Ragaz","CH","","","","+41 79 176 45 98","britta.wachsmann@bluewin.ch","","Männlich","29.06.2008","","Deutsch","AT","1.44.0.00.033","Sargans Sportschützen",0,0,0,1,"Aktiv-A G50m","","A","LizenzG50m","Herr","",0,0,"01.01.2023","","","",0,"1.44.0.00.033","Sargans Sportschützen","","","","Aktiv","","","","","","","","","04.09.2023","","","","01.12.2023 14:27"]
["1259721","311649","Céline","Depeder","","","Schützengasse 17","8224","Löhningen","CH","","","","076 334 02 56","celine.depeder@gmail.com","","Weiblich","01.02.1993","","Deutsch","CH","1.44.0.00.052","Wildhaus Sportschützen",1,0,0,1,"Aktiv-B G50m","","B","LizenzG50m","Frau","",0,0,"01.01.2023","","","",0,"1.44.0.00.013","Schaffhausen Sportschützen Munot","","","","Aktiv","Newsletter Email","Abonnement","27.07.2023","","Nein","Nein","","","","","",1,"01.12.2023 14:27"]
["1061525","113440","Hans","Brauchli","","","Untere Riethaldenstr. 6","9658","Wildhaus","CH","","","071 999 28 17","","ch-brauchli@bluewin.ch","","Männlich","27.10.1971","","Deutsch","CH","1.44.0.00.052","Wildhaus Sportschützen",1,0,0,1,"Aktiv-A G50m","","A","LizenzG50m","Herr","",0,0,"01.01.2023","","","",0,"1.44.0.00.052","Wildhaus Sportschützen","","","","Aktiv","","","","","","","","","","","","","01.12.2023 14:27"]
["1061255","113170","Thomas","Bieri","","","Töbeliweg 4","7320","Sargans","CH","","","081 723 72 14","079 830 68 48","tbieri@bluemail.ch","","Männlich","03.02.1989","756.2213.9590.09","Deutsch","CH","1.44.0.00.033","Sargans Sportschützen",1,0,0,1,"Aktiv-A G50m","","A","LizenzG50m","Herr","",0,1,"30.03.2008","","","",0,"1.44.0.00.033","Sargans Sportschützen","","","","Aktiv","Newsletter Email","Abonnement","27.07.2023","","Nein","Nein","","","","","",1,"01.12.2023 14:27"]
["1900794","981492","Damian","Oehler","","","Brüch 2358","9472","Grabserberg","CH","","","","","","","Männlich","17.02.2008","","Deutsch","CH","1.44.0.00.052","Wildhaus Sportschützen",1,0,0,1,"Aktiv-A G50m","","A","LizenzG50m","Herr","",0,1,"17.06.2020","","","",0,"1.44.0.00.052","Wildhaus Sportschützen","","","","Aktiv","Newsletter Email","Abonnement","27.07.2023","","Nein","Nein","","","","","",1,"01.12.2023 14:27"]
["1083321","135238","Stefan","Scherrer","","","Mühlegasse 7","8887","Mels","CH","","","","079 211 87 22","stefan_scherrer@bluewin.ch","","Männlich","16.12.1976","","Deutsch","CH","1.44.0.00.033","Sargans Sportschützen",1,0,0,1,"Aktiv-A G50m","","A","LizenzG50m","Herr","",0,0,"16.03.2004","","","",0,"1.17.0.06.101","Vilters Militärschützenverein","","","","Aktiv","Newsletter Email","Abonnement","27.07.2023","","Nein","Nein","","","","","",1,"01.12.2023 14:27"]
["1909579","990515","Talitha","Weitbrecht","","","Städtchenstr. 78","7320","Sargans","CH","","","","","","","Weiblich","14.08.2009","","Deutsch","CH","1.44.0.00.033","Sargans Sportschützen",1,0,0,1,"Aktiv-A G10m","","A","LizenzG10m","Frau","",0,0,"15.10.2022","","","",0,"1.44.0.00.033","Sargans Sportschützen","","","","Aktiv","Newsletter Email","Abonnement","27.07.2023","","Nein","Nein","","","","","",1,"01.12.2023 14:27"]
["1061022","112937","Armin","Spichtig","","","Leestr. 5","9658","Wildhaus","CH","","","","0796568441","arminspichtig@bluewin.ch","","Männlich","05.07.1961","","Deutsch","CH","1.44.0.00.052","Wildhaus Sportschützen",1,0,0,1,"Aktiv-B G50m","","B","LizenzG50m","Herr","",0,1,"19.04.2023","","","",0,"1.44.0.00.017","Grabs Sportschützen","","","","Aktiv","Newsletter Email","Abonnement","27.07.2023","","Nein","Nein","","","","","",1,"01.12.2023 14:27"]
["1254193","306121","Michael","Köppel","","","Laritschweg 1","7310","Bad Ragaz","CH","","","","079 223 84 82","michaelkoeppel1996@hotmail.com","","Männlich","16.01.1996","756.5701.0009.31","Deutsch","CH","1.44.0.00.033","Sargans Sportschützen",1,0,0,1,"Aktiv-A G50m","","A","LizenzG50m","Herr","",0,1,"12.02.2010","","","",0,"1.17.0.06.079","Sargans Schützenverein","","","","Aktiv","Newsletter Email","","","","","Nein","","","","","","","01.12.2023 14:27"]
["1254193","306121","Michael","Köppel","","","Laritschweg 1","7310","Bad Ragaz","CH","","","","079 223 84 82","michaelkoeppel1996@hotmail.com","","Männlich","16.01.1996","756.5701.0009.31","Deutsch","CH","1.44.0.00.033","Sargans Sportschützen",1,0,0,1,"Aktiv-A G10m","","A","LizenzG10m","Herr","",0,1,"11.11.2009","","","",0,"1.17.0.06.079","Sargans Schützenverein","","","","Aktiv","Newsletter Email","","","","","Nein","","","","","","","01.12.2023 14:27"]
["1059892","111807","Daniel","Siegenthaler","","","Gulerstr. 22b","7320","Sargans","CH","","","+41 81 723 76","078 231 00 71","daniel@siegenthaler.cc","","Männlich","28.10.1961","756.1202.9736.75","Deutsch","CH","1.44.0.00.033","Sargans Sportschützen",1,0,0,1,"Aktiv-A G10m","","A","LizenzG10m","Herr","daniel.siegenthler@swissshooting.ch",0,1,"01.01.2023","","","",0,"1.17.0.06.079","Sargans Schützenverein","","","","Aktiv","Newsletter Email","Gratisabo Ehrenmitglied SSV","03.02.2014","","Nein","Nein","","","","","",1,"01.12.2023 14:27"]